"ID","Sex","Age at MRI","WHO CNS Grade","Final pathologic diagnosis (WHO 2021)","MGMT status","MGMT index","1p/19q","IDH","1-dead 0-alive","OS","EOR","Biopsy prior to imaging"
"UCSF-PDGM-004","M",66,4,"Glioblastoma, IDH-wildtype","negative",0,,"wildtype",1,1303,"STR","No"
"UCSF-PDGM-005","F",80,4,"Glioblastoma, IDH-wildtype","indeterminate",,,"wildtype",1,274,"biopsy","No"
"UCSF-PDGM-007","M",70,4,"Glioblastoma, IDH-wildtype","indeterminate",,,"wildtype",1,417,"STR","No"
"UCSF-PDGM-008","M",70,4,"Glioblastoma, IDH-wildtype","negative",0,,"wildtype",1,185,"STR","No"
"UCSF-PDGM-009","F",68,4,"Glioblastoma, IDH-wildtype","negative",0,,"wildtype",1,389,"STR","No"
"UCSF-PDGM-010","M",39,4,"Glioblastoma, IDH-wildtype","positive",7,,"wildtype",0,17,"GTR","No"
"UCSF-PDGM-011","F",68,4,"Glioblastoma, IDH-wildtype","positive",5,,"wildtype",0,133,"STR","No"
"UCSF-PDGM-012","F",74,4,"Glioblastoma, IDH-wildtype","negative",0,,"wildtype",0,15,"GTR","No"
"UCSF-PDGM-013","F",65,4,"Glioblastoma, IDH-wildtype","positive",13,,"wildtype",1,322,"STR","No"
"UCSF-PDGM-014","F",64,4,"Glioblastoma, IDH-wildtype","positive",4,,"wildtype",1,313,"STR","No"
"UCSF-PDGM-015","M",50,4,"Glioblastoma, IDH-wildtype","negative",0,,"wildtype",1,54,"STR","No"
"UCSF-PDGM-016","F",57,4,"Glioblastoma, IDH-wildtype","positive",7,,"wildtype",0,14,"STR","Yes"
"UCSF-PDGM-017","M",54,4,"Glioblastoma, IDH-wildtype","negative",0,,"wildtype",1,241,"STR","No"
"UCSF-PDGM-018","M",51,4,"Glioblastoma, IDH-wildtype","positive",11,,"wildtype",0,1449,"GTR","No"
"UCSF-PDGM-019","F",50,4,"Glioblastoma, IDH-wildtype","positive",16,,"wildtype",1,719,"GTR","No"
"UCSF-PDGM-020","M",49,4,"Glioblastoma, IDH-wildtype","negative",0,,"wildtype",0,551,"GTR","No"
"UCSF-PDGM-021","M",41,4,"Astrocytoma, IDH-mutant","positive",8,,"mutated (NOS)",0,1759,"GTR","No"
"UCSF-PDGM-022","F",61,4,"Glioblastoma, IDH-wildtype","positive",14,,"wildtype",1,533,"STR","No"
"UCSF-PDGM-023","F",67,4,"Glioblastoma, IDH-wildtype","positive",12,"intact","wildtype",1,1161,"GTR","No"
"UCSF-PDGM-024","M",51,4,"Glioblastoma, IDH-wildtype","positive",1,,"wildtype",1,653,"STR","No"
"UCSF-PDGM-025","M",34,4,"Glioblastoma, IDH-wildtype","positive",14,"intact","wildtype",1,465,"STR","No"
"UCSF-PDGM-026","F",83,4,"Glioblastoma, IDH-wildtype","positive",3,,"wildtype",0,236,"biopsy","No"
"UCSF-PDGM-027","F",54,4,"Glioblastoma, IDH-wildtype","negative",0,,"wildtype",1,298,"STR","No"
"UCSF-PDGM-029","M",66,4,"Glioblastoma, IDH-wildtype","indeterminate",,,"wildtype",1,75,"biopsy","No"
"UCSF-PDGM-030","M",78,4,"Glioblastoma, IDH-wildtype","positive",3,,"wildtype",0,17,"STR","No"
"UCSF-PDGM-031","F",40,4,"Astrocytoma, IDH-mutant","positive",13,"intact","mutated (NOS)",1,824,"GTR","No"
"UCSF-PDGM-032","F",66,4,"Glioblastoma, IDH-wildtype","indeterminate",,,"wildtype",0,105,"STR","No"
"UCSF-PDGM-033","M",37,4,"Glioblastoma, IDH-wildtype","positive",10,,"wildtype",1,1489,"STR","No"
"UCSF-PDGM-034","M",63,4,"Glioblastoma, IDH-wildtype","negative",0,,"wildtype",0,52,"STR","No"
"UCSF-PDGM-035","M",69,4,"Glioblastoma, IDH-wildtype","positive",2,,"wildtype",1,132,"STR","No"
"UCSF-PDGM-036","M",52,4,"Glioblastoma, IDH-wildtype","positive",8,"intact","wildtype",0,1673,"GTR","No"
"UCSF-PDGM-037","M",74,4,"Glioblastoma, IDH-wildtype","positive",17,,"wildtype",0,460,"GTR","No"
"UCSF-PDGM-038","M",78,4,"Glioblastoma, IDH-wildtype","positive",16,,"wildtype",1,152,"STR","No"
"UCSF-PDGM-039","M",53,4,"Glioblastoma, IDH-wildtype","positive",1,,"wildtype",0,134,"GTR","No"
"UCSF-PDGM-040","M",65,4,"Glioblastoma, IDH-wildtype","positive",1,"intact","wildtype",1,716,"GTR","No"
"UCSF-PDGM-041","M",69,4,"Glioblastoma, IDH-wildtype","negative",0,,"wildtype",0,128,"STR","No"
"UCSF-PDGM-042","M",58,4,"Glioblastoma, IDH-wildtype","negative",0,,"wildtype",1,635,"GTR","No"
"UCSF-PDGM-043","F",58,4,"Glioblastoma, IDH-wildtype","positive",2,,"wildtype",1,1116,"GTR","No"
"UCSF-PDGM-044","M",38,4,"Astrocytoma, IDH-mutant","positive",6,,"mutated (NOS)",0,930,"STR","No"
"UCSF-PDGM-045","M",32,4,"Astrocytoma, IDH-mutant","positive",11,"relative co-deletion","mutated (NOS)",0,1718,"GTR","No"
"UCSF-PDGM-046","M",48,4,"Glioblastoma, IDH-wildtype","negative",0,,"wildtype",1,178,"STR","Yes"
"UCSF-PDGM-047","M",55,4,"Glioblastoma, IDH-wildtype","positive",1,,"wildtype",0,385,"STR","No"
"UCSF-PDGM-048","M",74,4,"Glioblastoma, IDH-wildtype","positive",16,,"wildtype",1,54,"biopsy","No"
"UCSF-PDGM-049","F",65,4,"Glioblastoma, IDH-wildtype","positive",13,,"wildtype",0,721,"STR","No"
"UCSF-PDGM-050","M",37,4,"Glioblastoma, IDH-wildtype","positive",7,,"wildtype",1,554,"GTR","No"
"UCSF-PDGM-053","F",64,4,"Glioblastoma, IDH-wildtype","positive",1,,"wildtype",0,575,"GTR","No"
"UCSF-PDGM-055","F",69,4,"Glioblastoma, IDH-wildtype","positive",13,,"wildtype",0,1328,"GTR","No"
"UCSF-PDGM-056","F",79,4,"Glioblastoma, IDH-wildtype","positive",16,,"wildtype",1,207,"STR","No"
"UCSF-PDGM-057","M",38,4,"Glioblastoma, IDH-wildtype","positive",4,,"wildtype",0,224,"STR","No"
"UCSF-PDGM-058","F",51,4,"Glioblastoma, IDH-wildtype","positive",14,"intact","wildtype",0,1540,"GTR","No"
"UCSF-PDGM-059","M",71,4,"Glioblastoma, IDH-wildtype","positive",1,,"wildtype",0,223,"STR","No"
"UCSF-PDGM-061","F",46,4,"Astrocytoma, IDH-mutant","positive",16,"intact","mutated (NOS)",0,1907,"STR","No"
"UCSF-PDGM-063","M",56,4,"Glioblastoma, IDH-wildtype","positive",2,,"wildtype",1,287,"STR","No"
"UCSF-PDGM-064","M",49,4,"Glioblastoma, IDH-wildtype","positive",2,,"wildtype",1,187,"GTR","No"
"UCSF-PDGM-065","M",64,4,"Glioblastoma, IDH-wildtype","positive",1,,"wildtype",1,167,"STR","No"
"UCSF-PDGM-066","F",38,4,"Glioblastoma, IDH-wildtype",,,"intact","wildtype",0,1913,"biopsy","No"
"UCSF-PDGM-067","M",71,4,"Glioblastoma, IDH-wildtype","positive",4,,"wildtype",1,299,"STR","No"
"UCSF-PDGM-068","M",54,4,"Glioblastoma, IDH-wildtype","negative",0,,"wildtype",1,336,"biopsy","No"
"UCSF-PDGM-069","M",55,4,"Glioblastoma, IDH-wildtype","positive",12,,"wildtype",1,245,"biopsy","No"
"UCSF-PDGM-070","M",66,4,"Glioblastoma, IDH-wildtype","positive",5,,"wildtype",1,678,"STR","No"
"UCSF-PDGM-071","F",71,4,"Glioblastoma, IDH-wildtype","negative",0,,"wildtype",1,315,"STR","No"
"UCSF-PDGM-072","M",52,4,"Glioblastoma, IDH-wildtype","positive",2,,"wildtype",0,184,"STR","No"
"UCSF-PDGM-073","F",54,4,"Astrocytoma, IDH-mutant","positive",12,,"mutated (NOS)",0,1617,"STR","No"
"UCSF-PDGM-074","M",61,4,"Glioblastoma, IDH-wildtype","negative",0,,"wildtype",0,583,"GTR","Yes"
"UCSF-PDGM-075","M",61,4,"Glioblastoma, IDH-wildtype","negative",0,"intact","wildtype",1,421,"GTR","No"
"UCSF-PDGM-076","M",76,4,"Glioblastoma, IDH-wildtype","positive",15,,"wildtype",0,108,"biopsy","No"
"UCSF-PDGM-077","M",84,4,"Glioblastoma, IDH-wildtype","positive",17,,"wildtype",1,142,"STR","No"
"UCSF-PDGM-078","F",79,4,"Glioblastoma, IDH-wildtype","positive",2,,"wildtype",1,354,"GTR","No"
"UCSF-PDGM-079","F",79,4,"Glioblastoma, IDH-wildtype","positive",1,,"wildtype",1,560,"STR","No"
"UCSF-PDGM-080","F",77,4,"Glioblastoma, IDH-wildtype","positive",4,,"wildtype",1,253,"GTR","No"
"UCSF-PDGM-082","M",60,4,"Glioblastoma, IDH-wildtype","positive",16,,"wildtype",0,6,"STR","No"
"UCSF-PDGM-083","F",62,4,"Glioblastoma, IDH-wildtype","positive",17,,"wildtype",1,260,"GTR","No"
"UCSF-PDGM-084","M",60,4,"Glioblastoma, IDH-wildtype","negative",0,,"wildtype",0,902,"GTR","No"
"UCSF-PDGM-085","M",77,4,"Glioblastoma, IDH-wildtype","negative",0,,"wildtype",0,232,"GTR","No"
"UCSF-PDGM-086","F",72,4,"Glioblastoma, IDH-wildtype","positive",15,,"wildtype",0,266,"STR","No"
"UCSF-PDGM-087","M",63,4,"Glioblastoma, IDH-wildtype","positive",7,"intact","wildtype",1,406,"GTR","No"
"UCSF-PDGM-088","F",60,4,"Glioblastoma, IDH-wildtype","positive",17,"intact","wildtype",0,1797,"GTR","No"
"UCSF-PDGM-089","M",25,4,"Astrocytoma, IDH-mutant","positive",4,"intact","IDH1 p.R132H",0,1785,"STR","No"
"UCSF-PDGM-090","M",65,4,"Glioblastoma, IDH-wildtype","positive",2,,"wildtype",1,749,"STR","No"
"UCSF-PDGM-091","M",79,4,"Glioblastoma, IDH-wildtype","positive",12,,"wildtype",1,463,"GTR","Yes"
"UCSF-PDGM-092","F",52,4,"Glioblastoma, IDH-wildtype","positive",1,,"wildtype",1,567,"GTR","No"
"UCSF-PDGM-093","M",79,4,"Glioblastoma, IDH-wildtype","positive",12,,"wildtype",1,994,"GTR","No"
"UCSF-PDGM-094","M",61,4,"Glioblastoma, IDH-wildtype","positive",12,,"wildtype",0,161,"STR","No"
"UCSF-PDGM-095","F",62,4,"Glioblastoma, IDH-wildtype","positive",13,,"wildtype",1,777,"STR","No"
"UCSF-PDGM-096","M",46,4,"Glioblastoma, IDH-wildtype","negative",0,,"wildtype",1,591,"STR","No"
"UCSF-PDGM-097","F",69,4,"Glioblastoma, IDH-wildtype","negative",0,"intact","wildtype",1,110,"STR","No"
"UCSF-PDGM-099","M",48,4,"Glioblastoma, IDH-wildtype","positive",3,,"wildtype",1,472,"GTR","No"
"UCSF-PDGM-101","M",50,4,"Glioblastoma, IDH-wildtype","negative",0,"intact","wildtype",1,705,"STR","No"
"UCSF-PDGM-102","M",45,4,"Glioblastoma, IDH-wildtype","positive",6,,"wildtype",0,798,"STR","No"
"UCSF-PDGM-103","M",55,4,"Glioblastoma, IDH-wildtype","positive",5,"intact","wildtype",0,1694,"GTR","No"
"UCSF-PDGM-104","M",52,4,"Glioblastoma, IDH-wildtype","positive",1,,"wildtype",1,70,"biopsy","No"
"UCSF-PDGM-105","M",66,4,"Glioblastoma, IDH-wildtype","negative",0,,"wildtype",1,667,"GTR","No"
"UCSF-PDGM-106","F",51,4,"Glioblastoma, IDH-wildtype","positive",3,"intact","wildtype",1,351,"GTR","No"
"UCSF-PDGM-107","F",62,4,"Glioblastoma, IDH-wildtype","positive",14,,"wildtype",0,175,"STR","No"
"UCSF-PDGM-108","M",29,4,"Astrocytoma, IDH-mutant","positive",8,,"mutated (NOS)",0,1715,"GTR","No"
"UCSF-PDGM-109","M",51,4,"Glioblastoma, IDH-wildtype","positive",16,"intact","wildtype",1,611,"STR","No"
"UCSF-PDGM-111","M",61,4,"Glioblastoma, IDH-wildtype","negative",0,,"wildtype",1,39,"biopsy","No"
"UCSF-PDGM-112","M",55,4,"Glioblastoma, IDH-wildtype","positive",1,,"wildtype",1,301,"STR","Yes"
"UCSF-PDGM-113","F",54,4,"Glioblastoma, IDH-wildtype","positive",11,"intact","wildtype",1,1351,"GTR","No"
"UCSF-PDGM-114","F",63,4,"Glioblastoma, IDH-wildtype","positive",12,,"wildtype",1,92,"GTR","No"
"UCSF-PDGM-115","M",58,4,"Glioblastoma, IDH-wildtype","negative",0,,"wildtype",1,430,"GTR","No"
"UCSF-PDGM-116","F",37,4,"Glioblastoma, IDH-wildtype","positive",14,"intact","wildtype",0,1611,"GTR","No"
"UCSF-PDGM-118","F",65,4,"Glioblastoma, IDH-wildtype","negative",0,,"wildtype",1,162,"GTR","No"
"UCSF-PDGM-119","M",49,4,"Astrocytoma, IDH-mutant","positive",15,"relative co-deletion","mutated (NOS)",0,1650,"STR","No"
"UCSF-PDGM-121","M",56,4,"Glioblastoma, IDH-wildtype","negative",0,"intact","wildtype",1,879,"GTR","No"
"UCSF-PDGM-122","M",64,4,"Glioblastoma, IDH-wildtype","positive",7,"intact","wildtype",1,1024,"GTR","No"
"UCSF-PDGM-123","M",52,4,"Glioblastoma, IDH-wildtype","negative",0,,"wildtype",0,485,"GTR","No"
"UCSF-PDGM-124","M",17,4,"Astrocytoma, IDH-mutant","negative",0,"intact","IDH1 p.R132H",0,1299,"STR","Yes"
"UCSF-PDGM-126","M",48,4,"Glioblastoma, IDH-wildtype","positive",7,"intact","wildtype",1,919,"GTR","No"
"UCSF-PDGM-127","M",53,4,"Glioblastoma, IDH-wildtype","positive",17,,"wildtype",0,1296,"GTR","No"
"UCSF-PDGM-128","M",60,4,"Glioblastoma, IDH-wildtype","positive",17,,"wildtype",0,645,"STR","No"
"UCSF-PDGM-129","M",47,4,"Glioblastoma, IDH-wildtype","positive",5,"intact","wildtype",1,553,"GTR","No"
"UCSF-PDGM-130","M",60,4,"Glioblastoma, IDH-wildtype","positive",16,,"wildtype",0,1440,"GTR","No"
"UCSF-PDGM-131","M",76,4,"Glioblastoma, IDH-wildtype","negative",0,,"wildtype",0,410,"GTR","No"
"UCSF-PDGM-132","M",29,4,"Astrocytoma, IDH-mutant","positive",12,"intact","IDH1 p.R132C",0,1139,"STR","No"
"UCSF-PDGM-133","F",64,4,"Glioblastoma, IDH-wildtype","positive",1,,"wildtype",1,109,"GTR","No"
"UCSF-PDGM-134","M",67,4,"Glioblastoma, IDH-wildtype","positive",2,,"wildtype",0,288,"STR","No"
"UCSF-PDGM-135","F",36,4,"Glioblastoma, IDH-wildtype","positive",2,"intact","wildtype",1,868,"GTR","No"
"UCSF-PDGM-136","M",78,4,"Glioblastoma, IDH-wildtype","positive",16,"intact","wildtype",1,586,"GTR","No"
"UCSF-PDGM-137","M",53,4,"Glioblastoma, IDH-wildtype","positive",16,"intact","wildtype",1,799,"GTR","No"
"UCSF-PDGM-138","F",58,4,"Glioblastoma, IDH-wildtype","positive",3,"intact","wildtype",1,624,"GTR","No"
"UCSF-PDGM-139","M",65,4,"Glioblastoma, IDH-wildtype","positive",17,"intact","wildtype",1,188,"GTR","No"
"UCSF-PDGM-140","M",76,4,"Glioblastoma, IDH-wildtype","positive",14,"intact","wildtype",1,39,"GTR","No"
"UCSF-PDGM-141","M",65,4,"Glioblastoma, IDH-wildtype","positive",1,"intact","wildtype",1,758,"GTR","No"
"UCSF-PDGM-142","M",61,4,"Glioblastoma, IDH-wildtype","negative",0,"intact","wildtype",1,430,"GTR","No"
"UCSF-PDGM-143","M",81,4,"Glioblastoma, IDH-wildtype","positive",12,"intact","wildtype",1,91,"biopsy","No"
"UCSF-PDGM-144","M",57,4,"Glioblastoma, IDH-wildtype","positive",15,"intact","wildtype",1,142,"STR","No"
"UCSF-PDGM-145","M",57,4,"Glioblastoma, IDH-wildtype","negative",0,"intact","wildtype",1,310,"GTR","No"
"UCSF-PDGM-146","M",57,4,"Glioblastoma, IDH-wildtype","negative",0,"intact","wildtype",0,1392,"GTR","No"
"UCSF-PDGM-147","M",58,4,"Astrocytoma, IDH-mutant","positive",13,"intact","IDH1 p.R132H",1,482,"STR","No"
"UCSF-PDGM-148","F",78,4,"Glioblastoma, IDH-wildtype","positive",16,"intact","wildtype",1,86,"biopsy","No"
"UCSF-PDGM-149","M",66,4,"Glioblastoma, IDH-wildtype","positive",1,"intact","wildtype",1,15,"GTR","No"
"UCSF-PDGM-150","M",51,4,"Glioblastoma, IDH-wildtype","positive",15,"intact","wildtype",1,1308,"GTR","No"
"UCSF-PDGM-151","F",66,4,"Glioblastoma, IDH-wildtype","negative",0,"intact","wildtype",1,611,"GTR","No"
"UCSF-PDGM-152","F",58,4,"Glioblastoma, IDH-wildtype","positive",2,"intact","wildtype",1,471,"STR","No"
"UCSF-PDGM-153","F",68,4,"Glioblastoma, IDH-wildtype","positive",13,"intact","wildtype",1,316,"GTR","No"
"UCSF-PDGM-154","M",63,4,"Glioblastoma, IDH-wildtype","negative",0,"intact","wildtype",1,394,"GTR","No"
"UCSF-PDGM-155","F",71,4,"Glioblastoma, IDH-wildtype","positive",15,"intact","wildtype",1,1132,"GTR","No"
"UCSF-PDGM-156","F",27,4,"Astrocytoma, IDH-mutant","positive",16,"intact","IDH1 p.R132C",0,1035,"GTR","Yes"
"UCSF-PDGM-157","F",60,4,"Glioblastoma, IDH-wildtype","positive",14,"intact","wildtype",0,902,"GTR","No"
"UCSF-PDGM-158","F",83,4,"Glioblastoma, IDH-wildtype","positive",13,"intact","wildtype",1,130,"GTR","No"
"UCSF-PDGM-159","F",65,4,"Glioblastoma, IDH-wildtype","positive",17,"intact","wildtype",1,729,"STR","No"
"UCSF-PDGM-160","F",67,4,"Glioblastoma, IDH-wildtype","positive",2,"intact","wildtype",1,628,"STR","No"
"UCSF-PDGM-161","M",29,4,"Glioblastoma, IDH-wildtype","positive",1,"intact","wildtype",1,248,"GTR","No"
"UCSF-PDGM-162","M",33,4,"Astrocytoma, IDH-mutant","positive",14,"intact","IDH1 p.R132C",0,1366,"STR","No"
"UCSF-PDGM-163","M",51,4,"Glioblastoma, IDH-wildtype","negative",0,"intact","wildtype",1,194,"STR","No"
"UCSF-PDGM-164","M",48,4,"Glioblastoma, IDH-wildtype","negative",0,"intact","wildtype",1,633,"GTR","No"
"UCSF-PDGM-165","M",70,4,"Glioblastoma, IDH-wildtype","positive",3,"intact","wildtype",1,60,"GTR","No"
"UCSF-PDGM-166","F",49,4,"Glioblastoma, IDH-wildtype","positive",2,"intact","wildtype",1,689,"STR","No"
"UCSF-PDGM-167","M",60,4,"Glioblastoma, IDH-wildtype","positive",17,"intact","wildtype",0,1196,"GTR","No"
"UCSF-PDGM-168","M",49,4,"Glioblastoma, IDH-wildtype","negative",0,"intact","wildtype",1,418,"GTR","No"
"UCSF-PDGM-169","M",79,4,"Glioblastoma, IDH-wildtype","positive",7,"intact","wildtype",1,,,"No"
"UCSF-PDGM-170","M",42,4,"Glioblastoma, IDH-wildtype","positive",16,"intact","wildtype",1,418,"biopsy","No"
"UCSF-PDGM-172","F",64,4,"Glioblastoma, IDH-wildtype","negative",0,"intact","wildtype",1,925,"GTR","No"
"UCSF-PDGM-173","M",80,4,"Glioblastoma, IDH-wildtype","positive",16,"intact","wildtype",1,72,"GTR","No"
"UCSF-PDGM-174","M",26,4,"Astrocytoma, IDH-mutant","positive",8,"intact","IDH1 p.R132H",1,376,"STR","No"
"UCSF-PDGM-175","M",36,4,"Glioblastoma, IDH-wildtype","negative",0,"intact","wildtype",1,1084,"STR","No"
"UCSF-PDGM-176","F",74,4,"Glioblastoma, IDH-wildtype","positive",2,"intact","wildtype",1,302,"GTR","No"
"UCSF-PDGM-178","F",77,4,"Glioblastoma, IDH-wildtype","negative",0,"intact","wildtype",1,676,"STR","No"
"UCSF-PDGM-179","M",75,4,"Glioblastoma, IDH-wildtype","positive",5,"intact","wildtype",0,1201,"GTR","No"
"UCSF-PDGM-180","M",71,4,"Glioblastoma, IDH-wildtype","negative",0,"intact","wildtype",1,494,"GTR","No"
"UCSF-PDGM-181","F",56,4,"Glioblastoma, IDH-wildtype","positive",13,"intact","wildtype",0,1167,"GTR","No"
"UCSF-PDGM-182","M",65,4,"Glioblastoma, IDH-wildtype","negative",0,"intact","wildtype",1,446,"GTR","No"
"UCSF-PDGM-183","F",76,4,"Glioblastoma, IDH-wildtype","positive",17,"intact","wildtype",0,1163,"GTR","No"
"UCSF-PDGM-184","F",59,4,"Glioblastoma, IDH-wildtype","positive",16,"intact","wildtype",1,545,"GTR","No"
"UCSF-PDGM-185","M",35,4,"Glioblastoma, IDH-wildtype","positive",15,"intact","wildtype",0,1142,"GTR","Yes"
"UCSF-PDGM-186","M",60,4,"Glioblastoma, IDH-wildtype","positive",2,"intact","wildtype",1,230,"GTR","No"
"UCSF-PDGM-187","F",61,4,"Glioblastoma, IDH-wildtype","positive",17,"intact","wildtype",1,115,"GTR","No"
"UCSF-PDGM-188","M",46,4,"Glioblastoma, IDH-wildtype","positive",2,"intact","wildtype",1,329,"STR","Yes"
"UCSF-PDGM-189","F",62,4,"Glioblastoma, IDH-wildtype","positive",3,"intact","wildtype",0,416,"STR","Yes"
"UCSF-PDGM-190","F",39,4,"Astrocytoma, IDH-mutant","positive",16,"intact","IDH1 p.R132H",0,698,"STR","No"
"UCSF-PDGM-191","F",26,4,"Glioblastoma, IDH-wildtype","positive",3,"intact","wildtype",1,837,"GTR","No"
"UCSF-PDGM-193","M",61,4,"Glioblastoma, IDH-wildtype","positive",11,"intact","wildtype",1,394,"GTR","Yes"
"UCSF-PDGM-194","F",52,4,"Glioblastoma, IDH-wildtype","positive",3,"intact","wildtype",1,512,"GTR","No"
"UCSF-PDGM-195","M",58,4,"Glioblastoma, IDH-wildtype","negative",0,"intact","wildtype",0,304,"STR","No"
"UCSF-PDGM-196","M",72,4,"Glioblastoma, IDH-wildtype","negative",0,"intact","wildtype",1,150,"GTR","No"
"UCSF-PDGM-197","M",43,4,"Glioblastoma, IDH-wildtype","negative",0,"intact","wildtype",1,809,"GTR","No"
"UCSF-PDGM-198","M",71,4,"Glioblastoma, IDH-wildtype","positive",3,"intact","wildtype",1,809,"GTR","No"
"UCSF-PDGM-200","F",65,4,"Glioblastoma, IDH-wildtype","positive",15,"intact","wildtype",1,141,"GTR","No"
"UCSF-PDGM-201","M",46,4,"Glioblastoma, IDH-wildtype","positive",1,"intact","wildtype",0,1015,"GTR","No"
"UCSF-PDGM-202","M",58,4,"Glioblastoma, IDH-wildtype","negative",0,"intact","wildtype",1,920,"GTR","No"
"UCSF-PDGM-203","M",81,4,"Glioblastoma, IDH-wildtype","negative",0,"intact","wildtype",0,421,"GTR","Yes"
"UCSF-PDGM-204","F",68,4,"Glioblastoma, IDH-wildtype","positive",1,"intact","wildtype",0,428,"GTR","No"
"UCSF-PDGM-205","F",67,4,"Astrocytoma, IDH-mutant","positive",11,"intact","IDH1 p.R132H",1,60,"GTR","Yes"
"UCSF-PDGM-206","M",35,4,"Astrocytoma, IDH-mutant","positive",2,"intact","IDH1 p.R132H",0,125,"STR","No"
"UCSF-PDGM-207","F",57,4,"Glioblastoma, IDH-wildtype","positive",1,"intact","wildtype",1,281,"GTR","No"
"UCSF-PDGM-208","M",73,4,"Glioblastoma, IDH-wildtype","positive",16,"intact","wildtype",1,52,"biopsy","Yes"
"UCSF-PDGM-209","F",61,4,"Glioblastoma, IDH-wildtype","negative",0,"intact","wildtype",1,446,"GTR","No"
"UCSF-PDGM-210","F",67,4,"Glioblastoma, IDH-wildtype","positive",14,"intact","wildtype",1,603,"GTR","No"
"UCSF-PDGM-212","F",86,4,"Glioblastoma, IDH-wildtype","negative",0,"intact","wildtype",1,48,"biopsy","No"
"UCSF-PDGM-213","M",76,4,"Glioblastoma, IDH-wildtype","positive",12,"intact","wildtype",1,361,"GTR","No"
"UCSF-PDGM-214","M",68,4,"Glioblastoma, IDH-wildtype","positive",17,"intact","wildtype",0,845,"GTR","No"
"UCSF-PDGM-215","M",79,4,"Glioblastoma, IDH-wildtype","positive",1,"intact","wildtype",0,128,"biopsy","Yes"
"UCSF-PDGM-223","M",55,4,"Glioblastoma, IDH-wildtype","positive",17,"intact","wildtype",0,961,"GTR","Yes"
"UCSF-PDGM-225","M",72,4,"Glioblastoma, IDH-wildtype","positive",1,"intact","wildtype",1,108,"biopsy","No"
"UCSF-PDGM-227","M",72,4,"Glioblastoma, IDH-wildtype","positive",17,"intact","wildtype",1,421,"GTR","Yes"
"UCSF-PDGM-228","F",89,4,"Glioblastoma, IDH-wildtype","negative",0,"intact","wildtype",1,203,"STR","No"
"UCSF-PDGM-229","M",69,4,"Glioblastoma, IDH-wildtype","negative",0,"intact","wildtype",1,476,"GTR","No"
"UCSF-PDGM-231","F",36,3,"Astrocytoma, IDH-mutant",,,"intact","mutated (NOS)",0,2043,"STR","No"
"UCSF-PDGM-232","M",22,2,"Astrocytoma, IDH-mutant","positive",11,"intact","IDH1 p.R132H",1,1612,"STR","No"
"UCSF-PDGM-233","F",31,2,"Astrocytoma, IDH-mutant",,,"intact","IDH1 p.R132H",0,1182,"STR","No"
"UCSF-PDGM-234","M",30,2,"Astrocytoma, IDH-mutant","positive",9,"intact","IDH1 p.R132G",1,2191,"GTR","No"
"UCSF-PDGM-235","F",34,2,"Astrocytoma, IDH-mutant",,,"intact","IDH2 p.R172K",0,1848,"GTR","No"
"UCSF-PDGM-236","F",35,2,"Oligodendroglioma, IDH-mutant, 1p/19q-codeleted",,,"co-deletion","mutated (NOS)",0,2209,"GTR","No"
"UCSF-PDGM-237","M",42,2,"Astrocytoma, IDH-mutant",,,"intact","mutated (NOS)",0,534,"STR","No"
"UCSF-PDGM-238","M",24,2,"Astrocytoma, IDH-mutant",,,"intact","IDH1 p.R132H",0,2098,"STR","No"
"UCSF-PDGM-239","M",57,2,"Oligodendroglioma, IDH-mutant, 1p/19q-codeleted",,,"co-deletion","mutated (NOS)",0,157,"STR","No"
"UCSF-PDGM-240","F",26,2,"Astrocytoma, IDH-mutant",,,"intact","mutated (NOS)",0,2018,"STR","No"
"UCSF-PDGM-241","M",30,3,"Astrocytoma, IDH-mutant",,,"intact","mutated (NOS)",0,1382,"STR","No"
"UCSF-PDGM-242","M",37,2,"Astrocytoma, IDH-mutant",,,"intact","mutated (NOS)",0,1833,"GTR","No"
"UCSF-PDGM-243","M",59,3,"Oligodendroglioma, IDH-mutant, 1p/19q-codeleted",,,"relative co-deletion","mutated (NOS)",0,1850,"STR","No"
"UCSF-PDGM-244","F",43,2,"Oligodendroglioma, IDH-mutant, 1p/19q-codeleted",,,"co-deletion","mutated (NOS)",0,1714,"STR","No"
"UCSF-PDGM-245","M",34,2,"Astrocytoma, IDH-mutant",,,"intact","IDH1 p.R132C",0,1840,"STR","No"
"UCSF-PDGM-246","F",46,2,"Astrocytoma, IDH-mutant",,,"intact","mutated (NOS)",0,41,"STR","No"
"UCSF-PDGM-247","M",26,2,"Oligodendroglioma, IDH-mutant, 1p/19q-codeleted",,,"co-deletion","mutated (NOS)",0,13,"STR","No"
"UCSF-PDGM-248","M",46,2,"Astrocytoma, IDH-mutant",,,"intact","IDH1 p.R132H",0,1643,"STR","No"
"UCSF-PDGM-249","M",59,3,"Astrocytoma, IDH-wildtype","positive",9,"intact","wildtype",0,22,"STR","No"
"UCSF-PDGM-250","M",44,2,"Astrocytoma, IDH-mutant",,,"intact","mutated (NOS)",0,14,"STR","No"
"UCSF-PDGM-251","M",36,3,"Astrocytoma, IDH-mutant",,,"intact","IDH1 p.R132H",0,689,"STR","No"
"UCSF-PDGM-252","F",35,2,"Astrocytoma, IDH-mutant",,,"intact","IDH1 p.R132G",0,1595,"STR","No"
"UCSF-PDGM-253","M",25,2,"Astrocytoma, IDH-mutant",,,"intact","IDH1 p.R132H",0,1547,"STR","Yes"
"UCSF-PDGM-254","F",53,3,"Astrocytoma, IDH-wildtype","negative",0,"intact","wildtype",1,718,"STR","No"
"UCSF-PDGM-255","F",40,2,"Astrocytoma, IDH-mutant",,,"intact","mutated (NOS)",0,1521,"GTR","No"
"UCSF-PDGM-256","F",28,2,"Astrocytoma, IDH-mutant",,,"intact","IDH1 p.R132H",0,1513,"GTR","No"
"UCSF-PDGM-257","M",32,2,"Astrocytoma, IDH-mutant",,,"intact","IDH1 p.R132H",0,1449,"STR","No"
"UCSF-PDGM-258","M",23,2,"Oligodendroglioma, IDH-mutant, 1p/19q-codeleted",,,"co-deletion","mutated (NOS)",0,187,"STR","No"
"UCSF-PDGM-259","M",28,2,"Astrocytoma, IDH-mutant",,,"intact","mutated (NOS)",1,1421,"STR","No"
"UCSF-PDGM-260","F",56,2,"Oligodendroglioma, IDH-mutant, 1p/19q-codeleted",,,"relative co-deletion","mutated (NOS)",0,1118,"GTR","No"
"UCSF-PDGM-261","F",29,2,"Astrocytoma, IDH-mutant",,,"intact","mutated (NOS)",0,805,"STR","No"
"UCSF-PDGM-262","M",44,3,"Astrocytoma, IDH-mutant","negative",0,"intact","IDH1 p.R132S",0,1190,"STR","No"
"UCSF-PDGM-263","M",54,3,"Astrocytoma, IDH-wildtype","positive",1,"intact","wildtype",1,663,"STR","Yes"
"UCSF-PDGM-264","F",48,2,"Astrocytoma, IDH-mutant",,,"intact","mutated (NOS)",0,839,"STR","No"
"UCSF-PDGM-265","F",44,2,"Oligodendroglioma, IDH-mutant, 1p/19q-codeleted",,,"co-deletion","mutated (NOS)",0,916,"STR","No"
"UCSF-PDGM-266","M",31,2,"Astrocytoma, IDH-mutant",,,"intact","mutated (NOS)",0,689,"STR","No"