AnonymPatientID,AnonymStudyDate,Sex,IDH1/2,MGMT,Response_1st_fup,Response_2nd_fup,Response_3rd_fup,Response_4th_fup,Response_5th_fup,Response_6th_fup,Response_7th_fup,Response_8th_fup,Response_9th_fup,Response_10th_fup,AnonymDate of surgery,AnonymStart of RT,AnonymEnd of RT,AnonymDate of topometric MRI,Anonym1st_fup,Anonym2nd_fup,Anonym3rd_fup,Anonym4th_fup,Anonym5th_fup,Anonym6th_fup,Anonym7th_fup,Anonym8th_fup,Anonym9th_fup,Anonym10th_fup,AnonymDeath,AgeAtStudyDate
Burdenko-GBM-001,5/6/04,F,negative,negative,response,stable,stable,stable,stable,,,,,,4/10/04,5/15/04,6/27/04,5/6/04,7/8/04,8/16/04,10/4/04,12/23/04,3/30/05, , , , , , ,51
Burdenko-GBM-002,9/9/04,M,positive,positive,response,response,progression,,,,,,,,8/14/04,1/12/05,2/25/05,9/9/04,12/10/04,3/30/05,6/17/05, , , , , , , ,8/11/05,72
Burdenko-GBM-003,9/8/04,M,,,progression,,,,,,,,,,5/21/04,9/17/04,10/28/04,9/8/04,11/26/04, , , , , , , , , ,12/5/05,64
Burdenko-GBM-004,9/5/04,F,negative,positive,stable,progression,progression,,,,,,,,8/14/04,9/17/04,10/28/04,9/5/04,11/17/04,2/15/05,3/23/05, , , , , , , ,12/2/06,54
Burdenko-GBM-005,9/11/04,F,negative,negative,stable,,,,,,,,,,8/28/04,9/17/04,10/28/04,9/11/04,11/18/04, , , , , , , , , , ,68
Burdenko-GBM-006,9/13/04,M,negative,negative,stable,stable,,,,,,,,,9/3/04,9/18/04,10/29/04,9/13/04,11/13/04,1/4/05, , , , , , , , ,7/26/06,45
Burdenko-GBM-007,9/12/04,F,positive,positive,pseudo progression,response,stable,response,,,,,,,8/20/04,9/18/04,10/29/04,9/12/04,10/28/04,1/14/05,3/9/05,5/4/05, , , , , , , ,40
Burdenko-GBM-008,9/3/05,F,,,response,,,,,,,,,,11/15/05,9/15/05,10/2/05,9/3/05,10/30/05,1/13/06, , , , , , , , , ,74
Burdenko-GBM-009,9/23/04,M,,positive,pseudo progression,response,response,,,,,,,,9/5/04,9/29/04,11/7/04,9/23/04,11/25/04,1/16/05,3/10/05, , , , , , , , ,59
Burdenko-GBM-010,9/11/05,M,negative,negative,stable,,,,,,,,,,7/29/05,9/17/05,10/29/05,9/11/05,11/18/05,1/26/06,7/12/06, , , , , , , , ,49
Burdenko-GBM-011,10/2/04,F,negative,,pseudo progression,response,response,,,,,,,,9/8/04,10/9/04,11/19/04,10/2/04,12/5/04,2/9/05,4/20/05, , , , , , , , ,44
Burdenko-GBM-012,10/7/04,F,,negative,progression,stable,progression,,,,,,,,9/10/04,10/13/04,11/21/04,10/7/04,12/18/04,2/19/05,5/1/05, , , , , , , ,12/14/05,63
Burdenko-GBM-013,10/9/04,M,negative,negative,response,stable,progression,,,,,,,,9/23/04,10/15/04,11/4/04,10/9/04,11/25/04,3/4/05,5/6/05, , , , , , , , ,76
Burdenko-GBM-014,10/13/04,F,negative,negative,response,progression,,,,,,,,,9/18/04,10/15/04,11/28/04,10/13/04,12/18/04,1/30/05, , , , , , , , ,9/29/06,58
Burdenko-GBM-015,10/4/04,M,negative,,progression,,,,,,,,,,9/11/04,10/20/04,11/28/04,10/4/04,12/21/04, , , , , , , , , , ,61
Burdenko-GBM-016,10/9/04,M,negative,,response,stable,,,,,,,,,9/5/04,10/20/04,11/28/04,10/9/04,12/18/04,2/25/05, , , , , , , , , ,49
Burdenko-GBM-017,10/14/04,M,negative,,response,stable,stable,,,,,,,,9/29/04,10/23/04,12/3/04,10/14/04,12/25/04,3/25/05,6/24/05, , , , , , , , ,57
Burdenko-GBM-018,10/20/04,F,negative,negative,pseudo progression,stable,response,stable,,,,,,,10/2/04,10/23/04,12/22/04,10/20/04,12/14/04,1/5/05,2/28/05,4/12/05, , , , , , ,12/14/06,53
Burdenko-GBM-019,10/16/04,F,negative,,stable,response,response,,,,,,,,9/10/04,10/23/04,12/4/04,10/16/04,12/16/04,3/31/05,6/4/05, , , , , , , , ,49
Burdenko-GBM-020,10/17/04,F,negative,,pseudo progression,pseudo progression,,,,,,,,,10/13/04,10/23/04,12/3/04,10/17/04,12/16/04,1/20/05, , , , , , , , , ,36
Burdenko-GBM-021,10/23/04,M,,negative,response,response,,,,,,,,,10/14/04,10/28/04,12/8/04,10/23/04,12/29/04,6/23/05, , , , , , , , , ,67
Burdenko-GBM-022,10/7/05,M,negative,negative,progression,,,,,,,,,,9/7/05,10/12/05,11/23/05,10/7/05,12/21/05,3/8/06, , , , , , , , , ,34
Burdenko-GBM-023,10/14/04,M,,negative,progression,,,,,,,,,,4/2/04,11/3/04,12/11/04,10/14/04,11/28/04, , , , , , , , , , ,60
Burdenko-GBM-024,10/31/04,M,,positive,response,response,,,,,,,,,10/14/04,11/5/04,12/17/04,10/31/04,12/29/04,4/10/05, , , , , , , , , ,69
Burdenko-GBM-025,11/3/04,M,negative,positive,response,stable,stable,,,,,,,,10/20/04,11/10/04,12/22/04,11/3/04,1/12/05,3/5/05,5/10/05, , , , , , , , ,56
Burdenko-GBM-026,10/30/04,M,,,response,stable,,,,,,,,,10/8/04,11/11/04,12/23/04,10/30/04,1/14/05,4/10/05, , , , , , , , , ,59
Burdenko-GBM-027,10/21/05,M,negative,negative,progression,progression,,,,,,,,,1/21/06,10/26/05,12/4/05,10/21/05,1/20/06,4/26/06, , , , , , , , ,9/2/06,46
Burdenko-GBM-028,10/31/04,F,positive,,progression,progression,,,,,,,,,10/6/04,11/12/04,1/1/05,10/31/04,1/31/05,4/19/05, , , , , , , , ,10/30/05,57
Burdenko-GBM-029,11/8/04,F,negative,negative,response,,,,,,,,,,10/22/04,11/13/04,12/26/04,11/8/04,1/14/05, , , , , , , , , , ,57
Burdenko-GBM-030,11/19/04,F,negative,negative,response,stable,"stable, distant progression",progression,,,,,,,10/27/04,11/26/04,1/7/05,11/19/04,1/3/05,1/31/05,4/4/05,4/27/05, , , , , , , ,47
Burdenko-GBM-031,8/16/00,F,,positive,response,stable,response,stable,progression,response,,,,,8/3/00,8/17/00,9/27/00,8/16/00,9/9/00,10/25/00,1/4/01,3/4/01,5/11/01,7/13/01, , , , , ,61
Burdenko-GBM-032,4/27/01,F,negative,,response,progression,,,,,,,,,3/21/01,5/2/01,6/14/01,4/27/01,6/7/01,11/14/04, , , , , , , , ,9/14/06,55
Burdenko-GBM-033,9/22/02,M,negative,,stable,distant progression,,,,,,,,,8/31/02,9/27/02,11/7/02,9/22/02,12/4/02,1/8/03, , , , , , , , ,4/18/03,47
Burdenko-GBM-034,10/25/03,M,,,response,response,response,progression,response,,,,,,10/8/03,11/1/03,12/12/03,10/25/03,12/17/03,3/11/04,5/19/04,7/30/04,12/12/04, , , , , ,2/14/05,85
Burdenko-GBM-035,10/26/03,F,negative,positive,stable,stable,progression,stable,progression,,,,,,9/3/03,11/5/03,12/14/03,10/26/03,12/30/03,3/22/04,6/7/04,8/16/04,9/24/04, , , , , ,3/18/07,61
Burdenko-GBM-036,11/22/00,M,negative,negative,progression,stable,stable,"response, distant progression",,,,,,,11/10/00,11/29/00,1/7/01,11/22/00,1/14/01,2/22/01,4/5/01,6/9/01, , , , , , ,9/21/01,59
Burdenko-GBM-037,11/9/01,F,,,response,stable,stable,response,response,stable,stable,stable,,,11/8/01,12/1/01,1/11/02,11/9/01,2/3/02,5/10/02,7/26/02,10/2/02,4/10/03,11/20/03,5/5/04,4/9/05, , , ,61
Burdenko-GBM-038,11/3/03,M,negative,,stable,progression,response,stable,distant progression,,,,,,10/15/03,11/7/03,12/14/03,11/3/03,1/7/04,3/21/04,5/31/04,7/29/04,10/6/04, , , , , ,3/17/05,53
Burdenko-GBM-039,10/31/03,M,,,response,response,progression,,,,,,,,10/29/03,11/14/03,12/11/03,10/31/03,1/2/04,5/21/04,8/28/04, , , , , , , , ,70
Burdenko-GBM-040,11/30/00,M,,,response,stable,progression,progression,,,,,,,11/16/00,12/7/00,1/13/01,11/30/00,2/9/01,4/3/01,8/22/01,11/30/01, , , , , , , ,60
Burdenko-GBM-041,11/17/00,F,negative,negative,response,progression,response,stable,stable,progression,progression,,,,11/10/00,12/6/00,1/31/01,11/17/00,1/3/01,4/28/01,9/20/01,1/2/02,4/3/02,6/20/02,8/31/02, , , , ,18
Burdenko-GBM-042,10/17/02,F,,,response,response,response,progression,progression,progression,,,,,9/12/02,10/24/02,12/5/02,10/17/02,12/26/02,2/19/03,5/14/03,8/12/03,8/30/03,10/11/03, , , , , ,56
Burdenko-GBM-043,10/4/02,M,positive,positive,progression,stable,response,response,stable,stable,stable,stable,stable,,10/3/02,10/25/02,12/5/02,10/4/02,12/23/02,2/13/03,4/24/03,8/13/03,11/13/03,4/1/04,6/26/04,10/27/04,3/3/05, , ,56
Burdenko-GBM-044,12/23/01,F,,,pseudo progression,response,progression,stable,stable,progression,,,,,11/30/01,12/29/01,2/8/02,12/23/01,3/2/02,5/4/02,9/5/02,4/24/03,6/12/03,8/31/03, , , , ,12/29/03,8
Burdenko-GBM-045,4/26/01,,,,,,,,,,,,,, , , , , , , , , , , , , , , ,
Burdenko-GBM-046,4/15/00,F,,,stable,progression,response,progression,stable,progression,,,,,1/28/00,4/28/00,6/9/00,4/15/00,6/24/00,10/21/00,2/4/01,4/28/01,8/4/01,12/26/01, , , , , ,68
Burdenko-GBM-047,12/30/01,F,negative,,pseudo progression,response,stable,response,stable,,,,,,12/6/01,1/3/02,2/16/02,12/30/01,3/27/02,8/11/02,11/3/02,1/11/04,1/16/05, , , , , , ,37
Burdenko-GBM-048,11/1/02,M,negative,negative,pseudo progression,response,stable,stable,progression,,,,,,10/30/02,11/28/02,1/9/03,11/1/02,2/2/03,6/16/03,11/11/03,2/5/04,5/29/04, , , , , ,12/4/04,70
Burdenko-GBM-049,4/17/03,M,negative,negative,stable,,,,,,,,,,3/28/03,4/23/03,6/11/03,4/17/03,7/14/03, , , , , , , , , ,10/25/03,51
Burdenko-GBM-050,11/17/02,F,,positive,response,,,,,,,,,,11/16/02,12/7/02,1/22/03,11/17/02,2/3/03, , , , , , , , , ,11/12/03,71
Burdenko-GBM-051,12/7/02,F,positive,positive,pseudo progression,pseudo progression,response,stable,,,,,,,11/6/02,12/14/02,1/30/03,12/7/02,2/16/03,4/23/03,10/9/03,11/7/03, , , , , , ,5/31/04,34
Burdenko-GBM-052,1/12/02,M,negative,positive,response,progression,,,,,,,,,11/24/01,1/23/02,3/3/02,1/12/02,3/2/02,7/3/02, , , , , , , , ,2/8/03,56
Burdenko-GBM-053,12/2/02,F,,,response,progression,,,,,,,,,6/29/02,12/18/02,1/30/03,12/2/02,2/25/03,7/17/03, , , , , , , , ,10/10/03,33
Burdenko-GBM-054,2/4/01,M,,,response,stable,stable,progression,response,progression,stable,stable,,,1/24/01,2/9/01,3/15/01,2/4/01,7/1/01,9/23/01,12/15/01,6/22/02,9/2/02,11/6/02,2/2/03,4/22/03, , ,6/9/04,32
Burdenko-GBM-055,11/21/02,F,negative,,progression,progression,,,,,,,,,6/23/02,12/25/02,2/2/03,11/21/02,3/28/03,5/29/03, , , , , , , , ,7/25/03,51
Burdenko-GBM-056,12/18/02,F,,negative,response,response,stable,,,,,,,,12/8/02,12/26/02,2/6/03,12/18/02,2/3/03,7/31/03,11/17/03, , , , , , , ,1/12/04,62
Burdenko-GBM-057,12/19/02,F,,,stable,progression,response,,,,,,,,11/28/02,12/27/02,2/7/03,12/19/02,3/1/03,5/15/03,9/27/03, , , , , , , , ,65
Burdenko-GBM-058,1/26/02,F,,,stable,progression,response,stable,progression,progression,,,,,1/19/02,2/1/02,3/14/02,1/26/02,4/6/02,7/7/02,9/19/02,9/18/03,9/29/04,11/3/04, , , , , ,38
Burdenko-GBM-059,1/20/02,M,,,pseudo progression,stable,response,stable,stable,stable,stable,progression,response,stable,12/28/01,2/1/02,3/14/02,1/20/02,4/7/02,6/5/02,10/22/02,2/11/03,6/7/03,1/29/04,5/19/04,9/4/04,10/27/04,4/1/05,8/22/05,55
Burdenko-GBM-060,1/31/02,F,,,response,response,stable,stable,,,,,,,1/20/02,2/1/02,3/14/02,1/31/02,4/2/02,8/18/02,12/8/02,2/5/03, , , , , , , ,32
Burdenko-GBM-061,1/30/02,F,,,response,progression,stable,,,,,,,,1/17/02,2/2/02,3/15/02,1/30/02,7/7/02,11/28/02,2/24/03, , , , , , , ,5/4/03,61
Burdenko-GBM-062,1/31/02,F,,negative,response,stable,progression,progression,progression,stable,distant progression,progression,,,1/19/02,2/2/02,3/15/02,1/31/02,4/14/02,7/6/02,8/11/02,10/17/02,2/8/03,5/16/03,12/27/03,1/7/04, , ,1/17/04,56
Burdenko-GBM-063,12/28/02,,,,,,,,,,,,,, , , , , , , , , , , , , , , ,
Burdenko-GBM-064,12/31/02,F,negative,positive,response,stable,stable,stable,stable,stable,stable,stable,stable,,12/19/02,1/8/03,2/15/03,12/31/02,3/4/03,6/4/03,8/22/03,12/9/03,2/3/04,4/27/04,7/13/04,10/12/04,1/25/05, , ,59
Burdenko-GBM-065,1/3/03,M,negative,positive,response,stable,stable,progression,progression,,,,,,12/14/02,1/8/03,2/20/03,1/3/03,3/1/03,5/29/03,8/21/03,5/28/04,9/7/04, , , , , , ,60
Burdenko-GBM-066,1/13/03,F,negative,negative,response,response,,,,,,,,,12/13/02,1/22/03,3/5/03,1/13/03,4/3/03,5/25/03, , , , , , , , ,3/25/05,57
Burdenko-GBM-067,5/4/01,M,negative,,response,stable,stable,progression,stable,stable,progression,progression,,,4/5/01,5/11/01,6/22/01,5/4/01,7/13/01,10/20/01,1/8/02,1/30/02,2/28/02,5/10/02,8/14/02,11/15/02, , ,3/7/03,52
Burdenko-GBM-068,4/20/03,F,,,response,stable,progression,response,stable,,,,,,4/2/03,4/26/03,5/18/03,4/20/03,6/3/03,7/19/03,9/17/03,2/18/04,6/18/04, , , , , ,2/23/05,74
Burdenko-GBM-069,2/6/03,M,negative,positive,pseudo progression,stable,stable,progression,"response, distant progression",,,,,,1/29/03,2/7/03,3/16/03,2/6/03,4/1/03,4/25/03,5/24/03,7/12/03,9/19/03, , , , , ,5/6/04,57
Burdenko-GBM-070,2/8/03,M,negative,negative,response,response,,,,,,,,,1/23/03,2/14/03,3/6/03,2/8/03,5/7/03,8/24/03, , , , , , , , ,8/4/05,69
Burdenko-GBM-071,4/2/01,M,,negative,pseudo progression,response,progression,progression,response,stable,progression,progression,progression,progression,3/14/01,4/5/01,5/17/01,4/2/01,6/22/01,11/24/01,3/3/02,5/29/02,10/24/02,4/4/03,7/2/03,9/24/03,1/8/04,3/3/04,9/4/04,54
Burdenko-GBM-072,5/2/03,M,negative,,response,stable,stable,stable,response,stable,stable,stable,,,4/12/03,5/7/03,6/21/03,5/2/03,9/18/03,10/9/03,12/10/03,2/13/04,8/15/04,12/3/04,3/2/05,6/4/05, , , ,42
Burdenko-GBM-073,5/1/03,M,,,stable,stable,progression,stable,,,,,,,3/9/03,5/14/03,7/2/03,5/1/03,8/2/03,1/25/04,8/21/04,2/4/05, , , , , , ,3/26/05,73
Burdenko-GBM-074,5/7/03,M,negative,negative,response,progression,progression,,,,,,,,4/13/03,5/15/03,6/27/03,5/7/03,6/28/03,3/28/04,7/10/04, , , , , , , , ,58
Burdenko-GBM-075,5/7/03,F,negative,positive,response,stable,distant progression,stable,stable,response,,,,,4/18/03,5/15/03,6/27/03,5/7/03,7/26/03,10/6/03,9/17/04,11/13/04,1/6/05,4/7/05, , , , ,3/17/08,61
Burdenko-GBM-076,5/18/01,M,,,stable,,,,,,,,,,4/28/01,5/31/01,7/11/01,5/18/01,8/18/01, , , , , , , , , , ,32
Burdenko-GBM-077,5/27/00,F,positive,negative,response,stable,stable,stable,stable,stable,stable,stable,stable,stable,5/14/00,6/2/00,7/13/00,5/27/00,8/10/00,10/29/00,12/22/00,5/17/01,10/6/01,1/25/02,10/5/02,12/28/02,6/15/03,5/15/04,1/22/06,27
Burdenko-GBM-078,3/31/00,M,,,pseudo progression,response,response,,,,,,,,2/19/00,4/6/00,5/17/00,3/31/00,5/6/00,7/5/00,9/6/00, , , , , , , , ,49
Burdenko-GBM-079,5/19/03,F,,negative,stable,pseudo progression,response,progression,,,,,,,4/23/03,6/6/03,7/20/03,5/19/03,8/4/03,9/9/03,12/2/03,1/12/04, , , , , , , ,68
Burdenko-GBM-080,6/2/02,M,,,response,progression,response,stable,stable,stable,stable,stable,progression,,5/2/02,6/7/02,6/29/02,6/2/02,8/2/02,11/23/02,3/1/03,6/20/03,8/29/03,11/27/03,2/20/04,6/18/04,9/22/04, , ,79
Burdenko-GBM-081,6/27/01,M,,,response,stable,progression,,,,,,,,6/14/01,7/4/01,8/19/01,6/27/01,9/7/01,11/30/01,1/12/02, , , , , , , , ,52
Burdenko-GBM-082,6/18/03,F,,,stable,progression,response,,,,,,,,5/31/03,6/21/03,8/17/03,6/18/03,9/6/03,11/13/03,1/9/04, , , , , , , ,1/18/04,66
Burdenko-GBM-083,6/21/03,M,negative,positive,response,stable,progression,progression,,,,,,,5/28/03,6/20/03,8/21/03,6/21/03,9/5/03,1/30/04,4/25/04,8/2/04, , , , , , , ,45
Burdenko-GBM-084,6/19/03,F,negative,,stable,stable,stable,stable,,,,,,,6/5/03,6/27/03,8/16/03,6/19/03,8/14/03,11/29/03,2/18/04,7/2/04, , , , , , ,9/11/04,49
Burdenko-GBM-085,6/21/03,M,negative,,response,response,stable,stable,,,,,,,5/29/03,6/27/03,8/16/03,6/21/03,9/6/03,12/4/03,2/18/04,6/1/04, , , , , , , ,54
Burdenko-GBM-086,4/3/03,M,negative,positive,response,distant progression,"response, distant progression",,,,,,,,3/6/03,4/9/03,5/25/03,4/3/03,6/11/03,10/22/03,12/5/03, , , , , , , ,1/5/04,59
Burdenko-GBM-087,7/6/01,M,,,response,stable,progression,progression,progression,,,,,,6/16/01,7/19/01,8/30/01,7/6/01,9/27/01,3/7/02,4/16/02,5/11/02,7/2/02, , , , , , ,63
Burdenko-GBM-088,7/11/01,F,,,response,distant progression,progression,,,,,,,,9/28/00,7/27/01,9/14/01,7/11/01,11/9/01,3/4/02,5/19/02, , , , , , , ,9/9/02,60
Burdenko-GBM-089,6/30/03,M,negative,positive,stable,progression,progression,stable,response,,,,,,6/13/03,7/5/03,8/30/03,6/30/03,9/9/03,11/17/03,4/17/04,6/16/04,10/24/04, , , , , ,4/12/05,55
Burdenko-GBM-090,6/22/03,F,negative,,stable,stable,progression,stable,progression,progression,,,,,5/25/03,7/10/03,9/6/03,6/22/03,9/27/03,1/19/04,4/12/04,8/16/04,12/13/04,1/6/05, , , , ,6/9/05,55
Burdenko-GBM-091,8/1/01,F,,,response,progression,response,stable,stable,stable,stable,progression,stable,stable,7/6/01,8/9/01,9/22/01,8/1/01,9/15/01,8/2/02,8/15/02,11/24/02,4/19/03,11/9/03,3/10/04,7/9/04,10/21/04,1/27/05, ,30
Burdenko-GBM-092,6/19/03,M,negative,negative,stable,progression,progression,progression,progression,response,stable,progression,,,6/25/03,7/25/03,9/11/03,7/13/03,10/2/03,6/16/04,8/13/04,9/26/04,1/27/05,4/24/05,7/27/05,12/16/05, , , ,53
Burdenko-GBM-093,8/5/01,M,,positive,pseudo progression,progression,response,stable,stable,progression,response,,,,6/29/01,8/10/01,9/23/01,8/5/01,10/28/01,11/29/01,2/18/02,9/1/02,2/26/03,4/1/04,7/19/04, , , ,7/11/05,55
Burdenko-GBM-094,7/3/02,M,positive,positive,pseudo progression,response,response,stable,stable,progression,,,,,6/15/02,7/10/02,8/24/02,7/3/02,9/27/02,1/13/03,5/17/03,8/9/03,11/1/03,2/12/04, , , , ,3/17/05,66
Burdenko-GBM-095,8/12/01,M,negative,negative,response,stable,progression,response,stable,stable,progression,,,,7/28/01,8/15/01,10/7/01,8/12/01,9/10/01,10/24/01,12/23/01,2/17/02,4/12/02,1/12/03,6/29/03, , , ,11/21/05,31
Burdenko-GBM-096,7/20/03,F,negative,positive,pseudo progression,stable,stable,progression,response,stable,,,,,6/25/03,8/3/03,9/2/03,7/20/03,9/4/03,11/4/03,2/16/04,6/8/04,9/6/04,2/2/05, , , , , ,60
Burdenko-GBM-097,6/15/02,F,negative,positive,stable,stable,progression,stable,progression,progression,,,,,6/22/02,7/19/02,9/15/02,7/13/02,8/30/02,10/5/02,12/19/02,2/8/03,8/2/03,11/10/03, , , , , ,53
Burdenko-GBM-098,8/18/01,M,,positive,response,response,response,progression,response,stable,,,,,8/10/01,8/22/01,10/6/01,8/18/01,10/20/01,3/6/02,6/9/02,2/8/03,6/4/03,10/5/03, , , , , ,54
Burdenko-GBM-099,8/24/01,M,,,stable,stable,progression,,,,,,,,8/11/01,8/30/01,10/13/01,8/24/01,11/22/01,1/16/02,4/6/02, , , , , , , ,4/18/02,69
Burdenko-GBM-100,8/31/00,F,,,response,stable,stable,stable,,,,,,,8/11/00,9/8/00,10/19/00,8/31/00,1/31/01,11/17/01,2/21/02,3/28/02, , , , , , , ,50
Burdenko-GBM-101,8/5/04,F,negative,,pseudo progression,pseudo progression,response,response,,,,,,,6/24/04,8/19/04,10/2/04,8/15/04,10/2/04,12/12/04,3/2/05,4/24/05, , , , , , , ,55
Burdenko-GBM-102,8/6/05,M,negative,negative,response,response,,,,,,,,,7/1/05,8/10/05,9/22/05,8/6/05,10/12/05,10/30/05, , , , , , , , ,3/14/07,37
Burdenko-GBM-103,8/12/04,F,negative,negative,response,stable,,,,,,,,,7/17/04,8/20/04,9/10/04,8/12/04,10/5/04,12/14/04, , , , , , , , ,3/26/05,73
Burdenko-GBM-104,8/21/04,M,negative,negative,stable,response,,,,,,,,,7/17/04,8/27/04,10/8/04,8/21/04,10/30/04,1/22/05, , , , , , , , , ,42
Burdenko-GBM-105,8/21/04,M,negative,negative,pseudo progression,response,distant progression,,,,,,,,7/22/04,8/28/04,10/10/04,8/21/04,11/3/04,2/11/05,5/19/05, , , , , , , ,11/23/05,54
Burdenko-GBM-106,8/19/04,M,negative,positive,progression,response,progression,,,,,,,,7/24/04,9/2/04,10/15/04,8/19/04,10/28/04,12/5/04,2/11/05, , , , , , , ,10/29/05,71
Burdenko-GBM-107,8/24/04,M,negative,negative,response,progression,progression,response,stable,stable,stable,progression,progression,,8/5/04,9/8/04,10/21/04,8/24/04,11/9/04,2/6/05,3/27/05,4/30/05,6/26/05,8/14/05,9/27/05,1/8/06,3/7/06, , ,51
Burdenko-GBM-108,9/4/04,M,negative,negative,stable,response,stable,,,,,,,,8/7/04,9/8/04,10/21/04,9/4/04,11/6/04,3/2/05,4/20/05, , , , , , , , ,58
Burdenko-GBM-109,9/3/04,F,negative,,response,stable,,,,,,,,,8/14/04,9/9/04,10/29/04,9/3/04,11/26/04,3/2/05, , , , , , , , , ,57
Burdenko-GBM-110,3/22/02,M,negative,positive,response,stable,stable,progression,response,stable,stable,stable,stable,progression,2/20/02,3/30/02,5/11/02,3/18/02,6/8/02,9/9/02,12/8/02,2/26/03,6/7/03,9/3/03,2/26/04,6/25/04,11/19/04,4/13/05, ,56
Burdenko-GBM-111,9/2/01,M,,,stable,stable,stable,"stable, distant progression",progression,progression,,,,,5/11/01,9/22/01,11/17/01,9/2/01,9/28/01,11/9/01,3/3/02,6/19/02,8/21/02,10/19/02, , , , ,5/8/03,61
Burdenko-GBM-112,8/23/03,M,,,pseudo progression,,,,,,,,,,7/5/03,9/17/03,10/5/03,8/23/03,11/1/03, , , , , , , , , ,1/9/05,74
Burdenko-GBM-113,7/28/02,F,,negative,response,stable,,,,,,,,,6/21/02,8/8/02,9/22/02,7/28/02,8/29/02,9/21/02, , , , , , , , , ,8
Burdenko-GBM-114,7/31/02,M,negative,positive,pseudo progression,response,stable,progression,progression,stable,progression,,,,7/10/02,8/3/02,9/15/02,7/31/02,9/26/02,11/30/02,2/14/03,5/1/03,6/18/03,8/9/03,9/27/03, , , ,12/26/04,54
Burdenko-GBM-115,4/9/03,F,negative,negative,response,response,stable,,,,,,,,2/12/03,4/16/03,6/1/03,4/9/03,6/21/03,9/11/03,11/6/03, , , , , , , ,1/7/04,59
Burdenko-GBM-116,9/26/03,F,positive,positive,stable,stable,response,stable,response,stable,distant progression,progression,,,9/10/03,10/1/03,11/12/03,9/26/03,10/15/03,12/3/03,2/2/04,3/26/04,6/5/04,8/14/04,11/26/04,1/11/05, , ,3/7/05,32
Burdenko-GBM-117,9/29/00,M,,,stable,"response, pseudo progression",progression,,,,,,,,9/7/00,10/6/00,11/16/00,9/29/00,11/24/00,2/4/01,4/29/01, , , , , , , , ,57
Burdenko-GBM-118,8/11/02,F,negative,negative,pseudo progression,response,stable,stable,,,,,,,7/19/02,8/29/02,10/12/02,7/20/02,10/31/02,12/27/02,1/18/03,3/28/03, , , , , , ,12/10/03,69
Burdenko-GBM-119,10/10/00,M,,,response,response,stable,progression,,,,,,,9/19/00,10/15/00,11/26/00,10/10/00,2/9/01,5/23/01,8/15/01,11/6/01, , , , , , ,9/4/02,58
Burdenko-GBM-120,10/6/03,M,,negative,progression,,,,,,,,,,9/18/03,10/10/03,10/30/03,10/6/03,11/30/03, , , , , , , , , ,1/26/04,78
Burdenko-GBM-121,10/4/03,M,negative,,response,stable,distant progression,,,,,,,,9/21/03,10/9/03,11/16/03,10/4/03,12/3/03,1/30/04,6/16/04, , , , , , , , ,51
Burdenko-GBM-122,10/6/03,M,negative,negative,response,stable,stable,progression,,,,,,,9/10/03,10/18/03,11/28/03,10/6/03,2/15/04,4/4/04,9/30/04,1/1/05, , , , , , ,3/6/05,59
Burdenko-GBM-123,6/22/03,M,negative,,pseudo progression,stable,progression,,,,,,,,9/4/03,10/18/03,11/28/03,10/7/03,12/12/03,6/1/04,8/23/04, , , , , , , , ,52
Burdenko-GBM-124,8/30/02,F,,,response,response,,,,,,,,,8/15/02,9/5/02,10/17/02,8/30/02,11/1/02,1/9/03, , , , , , , , ,2/25/03,66
Burdenko-GBM-125,10/25/00,F,,,response,progression,response,stable,progression,,,,,,9/20/00,10/27/00,12/7/00,10/25/00,1/19/01,3/2/01,5/20/01,7/26/02,9/26/02, , , , , , ,66
Burdenko-GBM-126,4/21/01,M,,,response,response,progression,,,,,,,,3/30/01,4/28/01,6/15/01,4/21/01,6/6/01,8/31/01,12/8/01, , , , , , , ,3/10/02,69
Burdenko-GBM-127,10/13/03,M,,,response,stable,stable,progression,progression,response,,,,,8/7/03,10/23/03,12/3/03,10/13/03,12/25/03,1/15/04,4/8/04,7/2/04,7/30/04,1/22/05, , , , ,12/28/05,57
Burdenko-GBM-128,11/7/00,M,,,pseudo progression,response,response,progression,,,,,,,10/27/00,11/11/00,12/23/00,11/7/00,1/16/01,3/30/01,6/28/01,8/9/01, , , , , , ,11/21/02,22
Burdenko-GBM-129,10/11/03,M,negative,,response,response,,,,,,,,,10/10/03,10/25/03,12/5/03,10/11/03,11/23/03,5/14/04, , , , , , , , ,7/27/06,54
Burdenko-GBM-130,10/15/01,F,,,response,stable,stable,stable,progression,,,,,,10/20/01,11/15/01,12/26/01,11/7/01,1/11/02,4/13/02,6/4/02,9/17/02,12/26/02, , , , , , ,65
Burdenko-GBM-131,1/28/05,F,,,response,,,,,,,,,,1/15/05,2/2/05,3/13/05,1/28/05,4/2/05, , , , , , , , , , ,64
Burdenko-GBM-132,1/27/05,M,,,progression,progression,,,,,,,,,1/14/05,2/2/05,3/13/05,1/27/05,3/29/05,4/19/05, , , , , , , , , ,59
Burdenko-GBM-133,2/3/05,F,negative,negative,response,response,,,,,,,,,1/15/05,2/4/05,3/14/05,2/3/05,3/30/05,5/28/05, , , , , , , , , ,53
Burdenko-GBM-134,2/6/05,F,negative,,response,stable,progression,,,,,,,,12/18/04,2/9/05,2/27/05,2/6/05,3/30/05,5/1/05,6/10/05, , , , , , , ,7/13/06,72
Burdenko-GBM-135,2/10/05,M,negative,negative,stable,response,,,,,,,,,2/2/05,2/12/05,3/14/05,2/10/05,3/31/05,6/26/05, , , , , , , , , ,59
Burdenko-GBM-136,5/20/04,F,negative,negative,pseudo progression,response,,,,,,,,,4/8/04,5/29/04,7/11/04,5/20/04,8/6/04,10/28/04, , , , , , , , , ,40
Burdenko-GBM-137,5/20/04,M,negative,negative,response,progression,,,,,,,,,4/24/04,5/28/04,7/8/04,5/20/04,7/17/04,10/5/04, , , , , , , , ,11/7/04,60
Burdenko-GBM-138,5/18/04,M,negative,negative,pseudo progression,response,stable,response,progression,progression,,,,,2/27/04,5/28/04,7/8/04,5/18/04,7/22/04,9/29/04,11/24/04,1/23/05,3/30/05,6/1/05, , , , ,8/13/05,59
Burdenko-GBM-139,6/3/04,M,,,response,response,stable,stable,stable,stable,,,,,4/21/04,6/9/04,7/25/04,6/3/04,8/19/04,10/10/04,12/5/04,1/30/05,4/9/05,6/4/05, , , , , ,69
Burdenko-GBM-140,6/23/04,F,,negative,progression,,stable,progression,,,,,,,5/20/04,6/26/04,8/11/04,6/23/04,9/5/04,9/29/04,12/30/04,5/5/05, , , , , , ,7/25/05,68