PatientID,ClinicalTrialTimePointID,SeriesInstanceUID,SeriesDescription,StudyDescription,StudyInstanceUID,StudyDate,Tracking ID,Tracking UID,ROIVolume,DICOM Type,StructureSetLabel,Annotation Type,ReferencedSeriesInstanceUID
ARAR0331-PASZWF,Pre-dose,1.2.826.0.1.534147.756.812677238.202312842427827.4,"Pre-dose,  RT NECK LYMPH NODE - 1",H/N IMRT,1.3.6.1.4.1.14519.5.2.1.1610.1217.156224480814438529039267968857,1960/03/01,Right_neck_lymph_node,2.25.74547812407246373401461704724676852386,5.431313,RTSS,RIGHT NECK LYMPH NODE,Segmentation,1.3.6.1.4.1.14519.5.2.1.1610.1217.291263029423180741260567706945
ARAR0331-PASZWF,Pre-dose,1.2.826.0.1.534147.756.812677238.202312842444516.4,"Pre-dose,  RT NECK LYMPH NODE - 1 - SEED POINT",H/N IMRT,1.3.6.1.4.1.14519.5.2.1.1610.1217.156224480814438529039267968857,1960/03/01,Right_neck_lymph_node,2.25.74547812407246373401461704724676852386,,RTSS,RIGHT NECK LYMPH NODE,Seed point,1.3.6.1.4.1.14519.5.2.1.1610.1217.291263029423180741260567706945
ARAR0331-PASZWF,Pre-dose,1.2.826.0.1.534147.756.812677238.202312842757425.4,"Pre-dose,  LT NECK LYMPH NODE - 2",H/N IMRT,1.3.6.1.4.1.14519.5.2.1.1610.1217.156224480814438529039267968857,1960/03/01,Left_neck_lymph_node,2.25.36945232476307811022554284020436576650,1.85148,RTSS,LEFT NECK LYMPH NODE,Segmentation,1.3.6.1.4.1.14519.5.2.1.1610.1217.291263029423180741260567706945
ARAR0331-PASZWF,Pre-dose,1.2.826.0.1.534147.756.812677238.202312842817597.4,"Pre-dose,  LT NECK LYMPH NODE - 2 - SEED POINT",H/N IMRT,1.3.6.1.4.1.14519.5.2.1.1610.1217.156224480814438529039267968857,1960/03/01,Left_neck_lymph_node,2.25.36945232476307811022554284020436576650,,RTSS,LEFT NECK LYMPH NODE,Seed point,1.3.6.1.4.1.14519.5.2.1.1610.1217.291263029423180741260567706945
ARAR0331-PASZWF,Pre-dose,1.2.826.0.1.534147.667.2747872357.202352112910402.4,"Pre-dose,  NASOPHARYNGEAL - 1",H/N IMRT,1.3.6.1.4.1.14519.5.2.1.1610.1217.156224480814438529039267968857,1960/03/01,Nasopharyngeal,2.25.323404423951972037669941213533953250576,4.237378,RTSS,NASOPHARYNGEAL,Segmentation,1.3.6.1.4.1.14519.5.2.1.1610.1217.291263029423180741260567706945
ARAR0331-PASZWF,Pre-dose,1.2.826.0.1.534147.667.2747872357.202352112922908.4,"Pre-dose,  NASOPHARYNGEAL - 1 - SEED POINT",H/N IMRT,1.3.6.1.4.1.14519.5.2.1.1610.1217.156224480814438529039267968857,1960/03/01,Nasopharyngeal,2.25.323404423951972037669941213533953250576,,RTSS,NASOPHARYNGEAL,Seed point,1.3.6.1.4.1.14519.5.2.1.1610.1217.291263029423180741260567706945
ARAR0331-PAPWTD,Pre-dose,1.2.826.0.1.534147.756.812677238.20231234756965.4,"Pre-dose,  NASOPHARYNGEAL - 1",MRI NECK WO W,1.3.6.1.4.1.14519.5.2.1.1610.1217.248649707467713524571609560035,1959/12/08,Nasopharyngeal,2.25.75149005868436354940267448100949839704,18.726345,RTSS,NASOPHARYNGEAL,Segmentation,1.3.6.1.4.1.14519.5.2.1.1610.1217.302981206745651846318186096253
ARAR0331-PAPWTD,Pre-dose,1.2.826.0.1.534147.756.812677238.20231234817157.4,"Pre-dose,  NASOPHARYNGEAL - 1 - SEED POINT",MRI NECK WO W,1.3.6.1.4.1.14519.5.2.1.1610.1217.248649707467713524571609560035,1959/12/08,Nasopharyngeal,2.25.75149005868436354940267448100949839704,,RTSS,NASOPHARYNGEAL,Seed point,1.3.6.1.4.1.14519.5.2.1.1610.1217.302981206745651846318186096253
ARAR0331-PAPWTD,Pre-dose,1.2.826.0.1.534147.756.812677238.20231234260549.4,"Pre-dose,  LT NECK LYMPH NODE - 1 - SEED POINT",MRI NECK WO W,1.3.6.1.4.1.14519.5.2.1.1610.1217.248649707467713524571609560035,1959/12/08,Left_neck_lymph_node,2.25.156964740565323384027960094389454296549,,RTSS,LEFT NECK LYMPH NODE,Seed point,1.3.6.1.4.1.14519.5.2.1.1610.1217.302981206745651846318186096253
ARAR0331-PAPWTD,Pre-dose,1.2.826.0.1.534147.756.812677238.2023127173225232.4,"Pre-dose,  LT NECK LYMPH NODE - 1",MRI NECK WO W,1.3.6.1.4.1.14519.5.2.1.1610.1217.248649707467713524571609560035,1959/12/08,Left_neck_lymph_node,2.25.156964740565323384027960094389454296549,31.401093,RTSS,LEFT NECK LYMPH NODE,Segmentation,1.3.6.1.4.1.14519.5.2.1.1610.1217.302981206745651846318186096253
ARAR0331-PAPWTD,Pre-dose,1.2.826.0.1.534147.756.812677238.202312343011406.4,"Pre-dose, No Findings",Thorax^6 Chest above 55 kg,1.3.6.1.4.1.14519.5.2.1.1610.1217.719538644869044671751219204226,1959/12/30,,,,RTSS,No Findings,No findings,1.3.6.1.4.1.14519.5.2.1.1610.1217.247754958499631890584511130106
ARAR0331-PAPWTD,Pre-dose,1.2.826.0.1.534147.756.812677238.202312343056928.4,"Pre-dose, No Findings",Thorax^6 Chest above 55 kg,1.3.6.1.4.1.14519.5.2.1.1610.1217.719538644869044671751219204226,1959/12/30,,,,RTSS,No Findings,No findings,1.3.6.1.4.1.14519.5.2.1.1610.1217.332542672392634067884763601995
ARAR0331-PAPWTD,Post-chemotherapy #1,1.2.826.0.1.534147.756.812677238.202312343618956.4,"Post-chemotherapy #1, No Findings",MRI BRAIN,1.3.6.1.4.1.14519.5.2.1.1610.1217.263370503726073637695349516460,1960/03/01,,,,RTSS,No Findings,No findings,1.3.6.1.4.1.14519.5.2.1.1610.1217.146370502332741232044838638654
ARAR0331-PAPWTD,Post-Chemotherapy #2,1.2.826.0.1.534147.756.812677238.202312343442296.4,"Post-Chemotherapy #2, No Findings",Thorax^01_CHEST (Adult),1.3.6.1.4.1.14519.5.2.1.1610.1217.209771473370303035098995534567,1960/08/07,,,,RTSS,No Findings,No findings,1.3.6.1.4.1.14519.5.2.1.1610.1217.287868154245387047461377576524
ARAR0331-PAPWTD,Post-Chemotherapy #2,1.2.826.0.1.534147.756.812677238.202312343527334.4,"Post-Chemotherapy #2, No Findings",Thorax^01_CHEST (Adult),1.3.6.1.4.1.14519.5.2.1.1610.1217.209771473370303035098995534567,1960/08/07,,,,RTSS,No Findings,No findings,1.3.6.1.4.1.14519.5.2.1.1610.1217.242961048544249625133492309076
ARAR0331-PAPWTD,Post-Chemotherapy #2,1.2.826.0.1.534147.756.812677238.202312343732933.4,"Post-Chemotherapy #2, No Findings",CHW^NECK,1.3.6.1.4.1.14519.5.2.1.1610.1217.265553075187136566647982226220,1960/08/07,,,,RTSS,No Findings,No findings,1.3.6.1.4.1.14519.5.2.1.1610.1217.271980548030359908704152232927
ARAR0331-PAUEJZ,Pre-dose,1.2.826.0.1.534147.756.812677238.2023296226744.4,"Pre-dose,  NASOPHARYNGEAL - 1",ORBIT/FACE/NECK W/O+W CONTRAST,1.3.6.1.4.1.14519.5.2.1.1610.1217.144926759814390079061877584250,1959/12/26,Nasopharyngeal,2.25.6939167800082282346250496286503076862,86.21803,RTSS,NASOPHARYNGEAL,Segmentation,1.3.6.1.4.1.14519.5.2.1.1610.1217.165886454539450063205428840009
ARAR0331-PAUEJZ,Pre-dose,1.2.826.0.1.534147.756.812677238.2023296251514.4,"Pre-dose,  NASOPHARYNGEAL - 1 - SEED POINT",ORBIT/FACE/NECK W/O+W CONTRAST,1.3.6.1.4.1.14519.5.2.1.1610.1217.144926759814390079061877584250,1959/12/26,Nasopharyngeal,2.25.6939167800082282346250496286503076862,,RTSS,NASOPHARYNGEAL,Seed point,1.3.6.1.4.1.14519.5.2.1.1610.1217.165886454539450063205428840009
ARAR0331-PAUEJZ,Pre-dose,1.2.826.0.1.534147.667.2747872357.202352862311985,"Pre-dose, No Findings",CHEST WITH CONTRAST,1.3.6.1.4.1.14519.5.2.1.1610.1217.321302156928529083982478811645,1959/12/27,,,,RTSS,No Findings,No findings,1.3.6.1.4.1.14519.5.2.1.1610.1217.219924452547905783420858753878
ARAR0331-PAUEJZ,Post-chemotherapy #1,1.2.826.0.1.534147.667.2747872357.202351963136161.4,"Post-chemotherapy #1,  NASOPHARYNGEAL - 1",ORBIT/FACE/NECK W/O+W CONTRAST,1.3.6.1.4.1.14519.5.2.1.1610.1217.931155505224424078687302812105,1960/02/18,Nasopharyngeal,2.25.6939167800082282346250496286503076862,74.709337,RTSS,NASOPHARYNGEAL,Segmentation,1.3.6.1.4.1.14519.5.2.1.1610.1217.167312733216291879498860186358
ARAR0331-PAUEJZ,Post-chemotherapy #1,1.2.826.0.1.534147.667.2747872357.202351963156178,"Post-chemotherapy #1,  NASOPHARYNGEAL - 1 - SEED POINT",ORBIT/FACE/NECK W/O+W CONTRAST,1.3.6.1.4.1.14519.5.2.1.1610.1217.931155505224424078687302812105,1960/02/18,Nasopharyngeal,2.25.6939167800082282346250496286503076862,,RTSS,NASOPHARYNGEAL,Seed point,1.3.6.1.4.1.14519.5.2.1.1610.1217.167312733216291879498860186358
ARAR0331-PAUEJZ,Post-Chemotherapy #2,1.2.826.0.1.534147.756.812677238.20232964122943.4,"Post-Chemotherapy #2,  NASOPHARYNGEAL - 1",BRAIN W/O+W CONTRAST,1.3.6.1.4.1.14519.5.2.1.1610.1217.216657409519643989550079097586,1960/04/11,Nasopharyngeal,2.25.6939167800082282346250496286503076862,112.192192,RTSS,NASOPHARYNGEAL,Segmentation,1.3.6.1.4.1.14519.5.2.1.1610.1217.252766442578837310180466315126
ARAR0331-PAUEJZ,Post-Chemotherapy #2,1.2.826.0.1.534147.756.812677238.20232964136679,"Post-Chemotherapy #2,  NASOPHARYNGEAL - 1 - SEED POINT",BRAIN W/O+W CONTRAST,1.3.6.1.4.1.14519.5.2.1.1610.1217.216657409519643989550079097586,1960/04/11,Nasopharyngeal,2.25.6939167800082282346250496286503076862,,RTSS,NASOPHARYNGEAL,Seed point,1.3.6.1.4.1.14519.5.2.1.1610.1217.252766442578837310180466315126
ARAR0331-PASRWH,Pre-dose,1.2.826.0.1.534147.756.812677238.20231238719764.4,"Pre-dose,  NASOPHARYNGEAL - 1 - SEED POINT",MRI BRAIN W+W/O CONT,1.3.6.1.4.1.14519.5.2.1.1610.1217.147694961761756267259212584551,1959/12/30,Nasopharyngeal,2.25.166091062685443268093213842541292782728,,RTSS,NASOPHARYNGEAL,Seed point,1.3.6.1.4.1.14519.5.2.1.1610.1217.606074950336561027547539316032
ARAR0331-PASRWH,Pre-dose,1.2.826.0.1.534147.667.2747872357.202358111232863.4,"Pre-dose,  NASOPHARYNGEAL - 1",MRI BRAIN W+W/O CONT,1.3.6.1.4.1.14519.5.2.1.1610.1217.147694961761756267259212584551,1959/12/30,Nasopharyngeal,2.25.166091062685443268093213842541292782728,20.570738,RTSS,NASOPHARYNGEAL,Segmentation,1.3.6.1.4.1.14519.5.2.1.1610.1217.606074950336561027547539316032
ARAR0331-PASRWH,Pre-dose,1.2.826.0.1.534147.667.2747872357.202358115232426.4,"Pre-dose,  NASOPHARYNGEAL - 1",CT H/N W/ CONT,1.3.6.1.4.1.14519.5.2.1.1610.1217.246427919262676988385226200949,1960/01/01 ,Nasopharyngeal,2.25.166091062685443268093213842541292782728,23.037671,RTSS,NASOPHARYNGEAL,Segmentation,1.3.6.1.4.1.14519.5.2.1.1610.1217.133183028264670837266791344220
ARAR0331-PASRWH,Pre-dose,1.2.826.0.1.534147.667.2747872357.2023520104811296.4,"Pre-dose,  RT CERVICAL LYMPH NODE - 1",MRI ORB/FACE/NECK W/WO CON BIL,1.3.6.1.4.1.14519.5.2.1.1610.1217.608180451419014417092952158199,1959/12/30,Right_cervical_lymph_node,2.25.284878310732197978220695217721455730054,10.152261,RTSS,RIGHT CERVICAL LYMPH NODE,Segmentation,1.3.6.1.4.1.14519.5.2.1.1610.1217.136116024585213718461423904483
ARAR0331-PASRWH,Pre-dose,1.2.826.0.1.534147.667.2747872357.2023520104821961.4,"Pre-dose,  RT CERVICAL LYMPH NODE - 1 - SEED POINT",MRI ORB/FACE/NECK W/WO CON BIL,1.3.6.1.4.1.14519.5.2.1.1610.1217.608180451419014417092952158199,1959/12/30,Right_cervical_lymph_node,2.25.284878310732197978220695217721455730054,,RTSS,RIGHT CERVICAL LYMPH NODE,Seed point,1.3.6.1.4.1.14519.5.2.1.1610.1217.136116024585213718461423904483
ARAR0331-PASRWH,Pre-dose,1.2.826.0.1.534147.667.2747872357.2023520104837897.4,"Pre-dose,  RT CERVICAL LYMPH NODE - 2",MRI ORB/FACE/NECK W/WO CON BIL,1.3.6.1.4.1.14519.5.2.1.1610.1217.608180451419014417092952158199,1959/12/30,Right_cervical_lymph_node,2.25.284878310732197978220695217721455730054,13.400771,RTSS,RIGHT CERVICAL LYMPH NODE,Segmentation,1.3.6.1.4.1.14519.5.2.1.1610.1217.136116024585213718461423904483
ARAR0331-PASRWH,Pre-dose,1.2.826.0.1.534147.667.2747872357.2023520104848326.4,"Pre-dose,  RT CERVICAL LYMPH NODE - 2 - SEED POINT",MRI ORB/FACE/NECK W/WO CON BIL,1.3.6.1.4.1.14519.5.2.1.1610.1217.608180451419014417092952158199,1959/12/30,Right_cervical_lymph_node,2.25.284878310732197978220695217721455730054,,RTSS,RIGHT CERVICAL LYMPH NODE,Seed point,1.3.6.1.4.1.14519.5.2.1.1610.1217.136116024585213718461423904483
ARAR0331-PASRWH,Pre-dose,1.2.826.0.1.534147.667.2747872357.2023520105054221.4,"Pre-dose,  NASOPHARYNGEAL - 1 - SEED POINT",CT H/N W/ CONT,1.3.6.1.4.1.14519.5.2.1.1610.1217.246427919262676988385226200949,1960/01/01 ,Nasopharyngeal,2.25.166091062685443268093213842541292782728,,RTSS,NASOPHARYNGEAL,Seed point,1.3.6.1.4.1.14519.5.2.1.1610.1217.133183028264670837266791344220
ARAR0331-PASRWH,Pre-dose,1.2.826.0.1.534147.667.2747872357.20235201051925.4,"Pre-dose,  RT CERVICAL LYMPH NODE - 1",CT H/N W/ CONT,1.3.6.1.4.1.14519.5.2.1.1610.1217.246427919262676988385226200949,1960/01/01 ,Right_cervical_lymph_node,2.25.284878310732197978220695217721455730054,5.501138,RTSS,RIGHT CERVICAL LYMPH NODE,Segmentation,1.3.6.1.4.1.14519.5.2.1.1610.1217.133183028264670837266791344220
ARAR0331-PASRWH,Pre-dose,1.2.826.0.1.534147.667.2747872357.202352010511942.4,"Pre-dose,  RT CERVICAL LYMPH NODE - 1 - SEED POINT",CT H/N W/ CONT,1.3.6.1.4.1.14519.5.2.1.1610.1217.246427919262676988385226200949,1960/01/01 ,Right_cervical_lymph_node,2.25.284878310732197978220695217721455730054,,RTSS,RIGHT CERVICAL LYMPH NODE,Seed point,1.3.6.1.4.1.14519.5.2.1.1610.1217.133183028264670837266791344220
ARAR0331-PASRWH,Pre-dose,1.2.826.0.1.534147.667.2747872357.202352010513058.4,"Pre-dose,  RT CERVICAL LYMPH NODE - 2",CT H/N W/ CONT,1.3.6.1.4.1.14519.5.2.1.1610.1217.246427919262676988385226200949,1960/01/01 ,Right_cervical_lymph_node,2.25.284878310732197978220695217721455730054,4.334105,RTSS,RIGHT CERVICAL LYMPH NODE,Segmentation,1.3.6.1.4.1.14519.5.2.1.1610.1217.133183028264670837266791344220
ARAR0331-PASRWH,Pre-dose,1.2.826.0.1.534147.667.2747872357.2023520105141745.4,"Pre-dose,  RT CERVICAL LYMPH NODE - 2 - SEED POINT",CT H/N W/ CONT,1.3.6.1.4.1.14519.5.2.1.1610.1217.246427919262676988385226200949,1960/01/01 ,Right_cervical_lymph_node,2.25.284878310732197978220695217721455730054,,RTSS,RIGHT CERVICAL LYMPH NODE,Seed point,1.3.6.1.4.1.14519.5.2.1.1610.1217.133183028264670837266791344220
ARAR0331-PASRWH,Pre-dose,1.2.826.0.1.534147.756.812677238.202312372015209,"Pre-dose, No Findings",CT CHEST W/O CONTRAST,1.3.6.1.4.1.14519.5.2.1.1610.1217.217731068960665928296234860293,1959/12/30,,,,RTSS,No Findings,No findings,1.3.6.1.4.1.14519.5.2.1.1610.1217.139174274767377532267851755778
ARAR0331-PASRWH,Post-chemotherapy #1,1.2.826.0.1.534147.667.2747872357.202352010542049.4,"Post-chemotherapy #1,  NASOPHARYNGEAL - 1",MRI BRAIN W/CON,1.3.6.1.4.1.14519.5.2.1.1610.1217.245362101541583187628978484469,1960/03/02,Nasopharyngeal,2.25.166091062685443268093213842541292782728,4.074014,RTSS,NASOPHARYNGEAL,Segmentation,1.3.6.1.4.1.14519.5.2.1.1610.1217.252267823412800817983470704149
ARAR0331-PASRWH,Post-chemotherapy #1,1.2.826.0.1.534147.667.2747872357.2023520105430307.4,"Post-chemotherapy #1,  NASOPHARYNGEAL - 1 - SEED POINT",MRI BRAIN W/CON,1.3.6.1.4.1.14519.5.2.1.1610.1217.245362101541583187628978484469,1960/03/02,Nasopharyngeal,2.25.166091062685443268093213842541292782728,,RTSS,NASOPHARYNGEAL,Seed point,1.3.6.1.4.1.14519.5.2.1.1610.1217.252267823412800817983470704149
ARAR0331-PASRWH,Post-chemotherapy #1,1.2.826.0.1.534147.667.2747872357.202352010544114.4,"Post-chemotherapy #1,  RT CERVICAL LYMPH NODE - 1",MRI BRAIN W/CON,1.3.6.1.4.1.14519.5.2.1.1610.1217.245362101541583187628978484469,1960/03/02,Right_cervical_lymph_node,2.25.284878310732197978220695217721455730054,0.589274,RTSS,RIGHT CERVICAL LYMPH NODE,Segmentation,1.3.6.1.4.1.14519.5.2.1.1610.1217.252267823412800817983470704149
ARAR0331-PASRWH,Post-chemotherapy #1,1.2.826.0.1.534147.667.2747872357.2023520105450919.4,"Post-chemotherapy #1,  RT CERVICAL LYMPH NODE - 1 - SEED POINT",MRI BRAIN W/CON,1.3.6.1.4.1.14519.5.2.1.1610.1217.245362101541583187628978484469,1960/03/02,Right_cervical_lymph_node,2.25.284878310732197978220695217721455730054,,RTSS,RIGHT CERVICAL LYMPH NODE,Seed point,1.3.6.1.4.1.14519.5.2.1.1610.1217.252267823412800817983470704149
ARAR0331-PASRWH,Post-chemotherapy #1,1.2.826.0.1.534147.667.2747872357.202352010550193.4,"Post-chemotherapy #1,  RT CERVICAL LYMPH NODE - 2",MRI BRAIN W/CON,1.3.6.1.4.1.14519.5.2.1.1610.1217.245362101541583187628978484469,1960/03/02,Right_cervical_lymph_node,2.25.284878310732197978220695217721455730054,1.017649,RTSS,RIGHT CERVICAL LYMPH NODE,Segmentation,1.3.6.1.4.1.14519.5.2.1.1610.1217.252267823412800817983470704149
ARAR0331-PASRWH,Post-chemotherapy #1,1.2.826.0.1.534147.667.2747872357.202352010558504.4,"Post-chemotherapy #1,  RT CERVICAL LYMPH NODE - 2 - SEED POINT",MRI BRAIN W/CON,1.3.6.1.4.1.14519.5.2.1.1610.1217.245362101541583187628978484469,1960/03/02,Right_cervical_lymph_node,2.25.284878310732197978220695217721455730054,,RTSS,RIGHT CERVICAL LYMPH NODE,Seed point,1.3.6.1.4.1.14519.5.2.1.1610.1217.252267823412800817983470704149
ARAR0331-PASRWH,Post-chemotherapy #1,1.2.826.0.1.534147.667.2747872357.2023520105716899,"Post-chemotherapy #1,  RT CERVICAL LYMPH NODE - 1",PET;W/CT SKULL BASE-MID THI,1.3.6.1.4.1.14519.5.2.1.1610.1217.995988648670502960913600190846,1960/03/03,Right_cervical_lymph_node,2.25.284878310732197978220695217721455730054,4.230828,RTSS,RIGHT CERVICAL LYMPH NODE,Segmentation,1.3.6.1.4.1.14519.5.2.1.1610.1217.272911096812612869593686583196
ARAR0331-PASRWH,Post-chemotherapy #1,1.2.826.0.1.534147.667.2747872357.2023520105729394.4,"Post-chemotherapy #1,  RT CERVICAL LYMPH NODE - 1 - SEED POINT",PET;W/CT SKULL BASE-MID THI,1.3.6.1.4.1.14519.5.2.1.1610.1217.995988648670502960913600190846,1960/03/03,Right_cervical_lymph_node,2.25.284878310732197978220695217721455730054,,RTSS,RIGHT CERVICAL LYMPH NODE,Seed point,1.3.6.1.4.1.14519.5.2.1.1610.1217.272911096812612869593686583196
ARAR0331-PASRWH,Post-chemotherapy #1,1.2.826.0.1.534147.667.2747872357.2023520105738499.4,"Post-chemotherapy #1,  NASOPHARYNGEAL - 1",PET;W/CT SKULL BASE-MID THI,1.3.6.1.4.1.14519.5.2.1.1610.1217.995988648670502960913600190846,1960/03/03,Nasopharyngeal,2.25.166091062685443268093213842541292782728,11.18802,RTSS,NASOPHARYNGEAL,Segmentation,1.3.6.1.4.1.14519.5.2.1.1610.1217.272911096812612869593686583196
ARAR0331-PASRWH,Post-chemotherapy #1,1.2.826.0.1.534147.667.2747872357.2023520105748686.4,"Post-chemotherapy #1,  NASOPHARYNGEAL - 1 - SEED POINT",PET;W/CT SKULL BASE-MID THI,1.3.6.1.4.1.14519.5.2.1.1610.1217.995988648670502960913600190846,1960/03/03,Nasopharyngeal,2.25.166091062685443268093213842541292782728,,RTSS,NASOPHARYNGEAL,Seed point,1.3.6.1.4.1.14519.5.2.1.1610.1217.272911096812612869593686583196
ARAR0331-PASRWH,Post-chemotherapy #1,1.2.826.0.1.534147.667.2747872357.202352010575887.4,"Post-chemotherapy #1,  RT CERVICAL LYMPH NODE - 2",PET;W/CT SKULL BASE-MID THI,1.3.6.1.4.1.14519.5.2.1.1610.1217.995988648670502960913600190846,1960/03/03,Right_cervical_lymph_node,2.25.284878310732197978220695217721455730054,4.690603,RTSS,RIGHT CERVICAL LYMPH NODE,Segmentation,1.3.6.1.4.1.14519.5.2.1.1610.1217.272911096812612869593686583196
ARAR0331-PASRWH,Post-chemotherapy #1,1.2.826.0.1.534147.667.2747872357.202352010588201.4,"Post-chemotherapy #1,  RT CERVICAL LYMPH NODE - 2 - SEED POINT",PET;W/CT SKULL BASE-MID THI,1.3.6.1.4.1.14519.5.2.1.1610.1217.995988648670502960913600190846,1960/03/03,Right_cervical_lymph_node,2.25.284878310732197978220695217721455730054,,RTSS,RIGHT CERVICAL LYMPH NODE,Seed point,1.3.6.1.4.1.14519.5.2.1.1610.1217.272911096812612869593686583196
ARAR0331-PASRWH,Post-chemotherapy #1,1.2.826.0.1.534147.667.2747872357.2023520105226121.4,"Post-chemotherapy #1, No Findings",CT CHEST W/CONTRAST,1.3.6.1.4.1.14519.5.2.1.1610.1217.123020878014965877287586907549,1960/03/02,,,,RTSS,No Findings,No findings,1.3.6.1.4.1.14519.5.2.1.1610.1217.114608895283941077250442115274
ARAR0331-PASRWH,Post-Chemotherapy #2,1.2.826.0.1.534147.667.2747872357.202352011143613.4,"Post-Chemotherapy #2,  RT CERVICAL LYMPH NODE - 1",MRI ORB/FACE/NECK W/WO CON BIL,1.3.6.1.4.1.14519.5.2.1.1610.1217.119137502093203338410377294939,1960/06/17,Right_cervical_lymph_node,2.25.284878310732197978220695217721455730054,0.560682,RTSS,RIGHT CERVICAL LYMPH NODE,Segmentation,1.3.6.1.4.1.14519.5.2.1.1610.1217.212748934458268064752290074490
ARAR0331-PASRWH,Post-Chemotherapy #2,1.2.826.0.1.534147.667.2747872357.202352011154995.4,"Post-Chemotherapy #2,  RT CERVICAL LYMPH NODE - 1 - SEED POINT",MRI ORB/FACE/NECK W/WO CON BIL,1.3.6.1.4.1.14519.5.2.1.1610.1217.119137502093203338410377294939,1960/06/17,Right_cervical_lymph_node,2.25.284878310732197978220695217721455730054,,RTSS,RIGHT CERVICAL LYMPH NODE,Seed point,1.3.6.1.4.1.14519.5.2.1.1610.1217.212748934458268064752290074490
ARAR0331-PASRWH,Post-Chemotherapy #2,1.2.826.0.1.534147.667.2747872357.20235201127554,"Post-Chemotherapy #2,  RT CERVICAL LYMPH NODE - 2",MRI ORB/FACE/NECK W/WO CON BIL,1.3.6.1.4.1.14519.5.2.1.1610.1217.119137502093203338410377294939,1960/06/17,Right_cervical_lymph_node,2.25.284878310732197978220695217721455730054,0.145334,RTSS,RIGHT CERVICAL LYMPH NODE,Segmentation,1.3.6.1.4.1.14519.5.2.1.1610.1217.212748934458268064752290074490
ARAR0331-PASRWH,Post-Chemotherapy #2,1.2.826.0.1.534147.667.2747872357.202352011217565.4,"Post-Chemotherapy #2,  RT CERVICAL LYMPH NODE - 2 - SEED POINT",MRI ORB/FACE/NECK W/WO CON BIL,1.3.6.1.4.1.14519.5.2.1.1610.1217.119137502093203338410377294939,1960/06/17,Right_cervical_lymph_node,2.25.284878310732197978220695217721455730054,,RTSS,RIGHT CERVICAL LYMPH NODE,Seed point,1.3.6.1.4.1.14519.5.2.1.1610.1217.212748934458268064752290074490
ARAR0331-PASRWH,Post-Chemotherapy #2,1.2.826.0.1.534147.667.2747872357.202352010599502,"Post-Chemotherapy #2, No Findings",CT CHEST W/CONTRAST,1.3.6.1.4.1.14519.5.2.1.1610.1217.619213389644453264975368238539,1960/06/17,,,,RTSS,No Findings,No findings,1.3.6.1.4.1.14519.5.2.1.1610.1217.338543840802838923304899590461
ARAR0331-PASRWH,Post-Chemotherapy #2,1.2.826.0.1.534147.667.2747872357.2023520105945135.1,"Post-Chemotherapy #2, No Findings",MRI BRAIN W+W/O CONT,1.3.6.1.4.1.14519.5.2.1.1610.1217.309736313193991685447319529572,1960/06/17,,,,RTSS,No Findings,No findings,1.3.6.1.4.1.14519.5.2.1.1610.1217.279567007742998861226794138223
ARAR0331-PASRWH,Post-Chemotherapy #3,1.2.826.0.1.534147.667.2747872357.20235201131267.4,"Post-Chemotherapy #3,  LT LUNG - 1",CT CHEST W/CONTRAST,1.3.6.1.4.1.14519.5.2.1.1610.1217.234240115881983603185163304783,1960/08/04,Left_lung,2.25.225373121405360855947346470522960652812,1.915919,RTSS,LEFT LUNG,Segmentation,1.3.6.1.4.1.14519.5.2.1.1610.1217.198068366447709207635698654331
ARAR0331-PASRWH,Post-Chemotherapy #3,1.2.826.0.1.534147.667.2747872357.202352011316357.4,"Post-Chemotherapy #3,  LT LUNG - 1 - SEED POINT",CT CHEST W/CONTRAST,1.3.6.1.4.1.14519.5.2.1.1610.1217.234240115881983603185163304783,1960/08/04,Left_lung,2.25.225373121405360855947346470522960652812,,RTSS,LEFT LUNG,Seed point,1.3.6.1.4.1.14519.5.2.1.1610.1217.198068366447709207635698654331
ARAR0331-PASRWH,Post-Chemotherapy #3,1.2.826.0.1.534147.667.2747872357.20235201143502.4,"Post-Chemotherapy #3, No Findings",MRI BRAIN W+W/O CONT,1.3.6.1.4.1.14519.5.2.1.1610.1217.246786794185475618949083869394,1960/08/04,,,,RTSS,No Findings,No findings,1.3.6.1.4.1.14519.5.2.1.1610.1217.178106041790727811597893847668
ARAR0331-PARIMW,Pre-dose,1.2.826.0.1.534147.667.2747872357.202352012840272.4,"Pre-dose,  NASOPHARYNGEAL - 1",CT NECK WITH CE,1.3.6.1.4.1.14519.5.2.1.1610.1217.245094531493448480837152695337,1959/12/03,Nasopharyngeal,2.25.193229719181301276778048532762437169412,3.26923,RTSS,NASOPHARYNGEAL,Segmentation,1.3.6.1.4.1.14519.5.2.1.1610.1217.301166427597320787608635574754
ARAR0331-PARIMW,Pre-dose,1.2.826.0.1.534147.667.2747872357.202352012856793.4,"Pre-dose,  NASOPHARYNGEAL - 1 - SEED POINT",CT NECK WITH CE,1.3.6.1.4.1.14519.5.2.1.1610.1217.245094531493448480837152695337,1959/12/03,Nasopharyngeal,2.25.193229719181301276778048532762437169412,,RTSS,NASOPHARYNGEAL,Seed point,1.3.6.1.4.1.14519.5.2.1.1610.1217.301166427597320787608635574754
ARAR0331-PARIMW,Pre-dose,1.2.826.0.1.534147.667.2747872357.202352012921774,"Pre-dose,  RT CERVICAL LYMPH NODE - 1",CT NECK WITH CE,1.3.6.1.4.1.14519.5.2.1.1610.1217.245094531493448480837152695337,1959/12/03,Right_cervical_lymph_node,2.25.123129227250081387114639469464314409119,2.58086,RTSS,RIGHT CERVICAL LYMPH NODE,Segmentation,1.3.6.1.4.1.14519.5.2.1.1610.1217.301166427597320787608635574754
ARAR0331-PARIMW,Pre-dose,1.2.826.0.1.534147.667.2747872357.202352012933313.4,"Pre-dose,  RT CERVICAL LYMPH NODE - 1 - SEED POINT",CT NECK WITH CE,1.3.6.1.4.1.14519.5.2.1.1610.1217.245094531493448480837152695337,1959/12/03,Right_cervical_lymph_node,2.25.123129227250081387114639469464314409119,,RTSS,RIGHT CERVICAL LYMPH NODE,Seed point,1.3.6.1.4.1.14519.5.2.1.1610.1217.301166427597320787608635574754