Case ID,Patient affiliation,De-identified age at Histological Diagnosis,Weight (lbs),Gender,Ethnicity,Smoking status,Pack Years,Quit Smoking Offset Year,,,Histology ,"Histology, if 'Other' selected above",Pathological T stage,Pathological N stage,Pathological M stage,AJCC Staging (Version 7),Histopathological Grade,Lymphovascular invasion,"Pleural invasion (elastic, visceral, parietal)",EGFR mutation status,KRAS mutation status,ALK translocation status,Adjuvant Treatment,Chemotherapy,Radiation,Recurrence,Recurrence Location,Location of Recurrence,Shifted date of Recurrence,Recurrence Notes,Shifted date of Last Known Alive,Time to Last Follow-up,Survival Status,Shifted date of Death,Time to Death (days),CT Shifted date,PET Shifted date,PET SUVmax ,PET SULmax,PET SUVpeak,PET SULpeak
AMC-001,Stanford,,,Male,,Nonsmoker,,,,0,Adenocarcinoma,,,,,,,,,Wildtype,Mutant,Wildtype,no,,,yes,distant,"Brain, multiple nodules (LUL, RUL), pleura",10/7/1994,CT,1/7/1997,,Dead,1/7/1997,,8/10/1994,,,,,
AMC-002,Stanford,,,Female,,Nonsmoker,,,,0,Adenocarcinoma,,,,,,,,,Wildtype,Wildtype,Not collected,unknown,,,unknown,,,,,3/20/1992,,Alive,,,2/19/1992,,,,,
AMC-003,Stanford,,,Female,,Nonsmoker,,,,0,Adenocarcinoma,,,,,,,,,Mutant,Wildtype,Wildtype,no,,,no,,,,,6/19/1996,,Alive,,,2/23/1995,,,,,
AMC-004,Stanford,,,Female,,Nonsmoker,,,,0,Adenocarcinoma,,,,,,,,,Wildtype,Wildtype,Wildtype,no,,,no,,,,,12/13/1996,,Alive,,,12/26/1992,,,,,
AMC-005,Stanford,,,Male,,Former,30,1980,13,1967,Adenocarcinoma,,,,,,,,,Mutant,Wildtype,Wildtype,no,,,yes,distant,RUL,1/4/1996,CT,1/7/1997,,Alive,,,7/21/1994,,,,,
AMC-006,Stanford,,,Female,,Former,4,1958,13,1945,Adenocarcinoma,,,,,,,,,Wildtype,Not collected,Not collected,no,,,no,,,,,8/17/1993,,Alive,,,8/9/1991,,,,,
AMC-007,Stanford,,,Female,,Nonsmoker,,,,0,Adenocarcinoma,,,,,,,,,Wildtype,Wildtype,Not collected,no,,,no,,,,,4/27/1995,,Alive,,,2/22/1992,,,,,
AMC-008,Stanford,,,Female,,Former,25,1991,13,1978,Adenocarcinoma,,,,,,,,,Not collected,Mutant,Not collected,no,,,no,,,,,1/7/1997,,Alive,,,7/17/1993,,,,,
AMC-009,Stanford,,,Male,,Former,30,2000,13,1987,Adenocarcinoma,,,,,,,,,Wildtype,Mutant,Wildtype,no,,,no,,,,,7/6/1993,,Dead,7/6/1993,,5/6/1993,,,,,
AMC-010,Stanford,,,Female,,Nonsmoker,,,,0,Adenocarcinoma,,,,,,,,,Mutant,Wildtype,Wildtype,no,,,no,,,,,11/16/1996,,Alive,,,8/24/1994,,,,,
AMC-011,Stanford,,,Female,,Former,16,1981,13,1968,Adenocarcinoma,,,,,,,,,Wildtype,Mutant,Wildtype,yes,Yes,,yes,distant,RML,3/17/1994,CT,1/11/1997,,Alive,,,10/16/1992,,,,,
AMC-012,Stanford,,,Female,,Nonsmoker,,,,0,Adenocarcinoma,,,,,,,,,Mutant,Wildtype,Wildtype,no,,,yes,distant,LLL,3/2/1994,CT,1/8/1997,,Alive,,,11/11/1993,,,,,
AMC-013,Stanford,,,Female,,Nonsmoker,,,,0,Adenocarcinoma,,,,,,,,,Mutant,Wildtype,Wildtype,no,,,no,,,,,10/9/1996,,Alive,,,3/4/1993,,,,,
AMC-014,Stanford,,,Female,,Former,98,2011,13,1998,Adenocarcinoma,,,,,,,,,Wildtype,Wildtype,Wildtype,no,,,no,,,,,10/16/1996,,Alive,,,11/21/1992,,,,,
AMC-015,Stanford,,,Male,,Former,45,1992,13,1979,Adenocarcinoma,,,,,,,,,Wildtype,Mutant,Not collected,no,,,no,,,,,7/13/1995,,Alive,,,2/5/1992,,,,,
AMC-016,Stanford,,,Male,,Former,,2012,13,1999,Adenocarcinoma,,,,,,,,,Wildtype,Wildtype,Wildtype,no,,,no,,,,,12/1/1995,,Alive,,,3/11/1994,,,,,
AMC-017,Stanford,,,Male,,Former,40,1985,13,1972,Adenocarcinoma,,,,,,,,,Wildtype,Wildtype,Not collected,no,,,no,,,,,11/7/1992,,Dead,11/7/1992,,9/29/1992,,,,,
AMC-018,Stanford,,,Female,,Former,20,1988,13,1975,Adenocarcinoma,,,,,,,,,Wildtype,Wildtype,Wildtype,no,,,no,,,,,9/26/1996,,Alive,,,12/1/1993,,,,,
AMC-019,Stanford,,,Female,,Former,3,1964,13,1951,Adenocarcinoma,,,,,,,,,Mutant,Not collected,Not collected,no,,,no,,,,,1/18/1995,,Alive,,,12/6/1991,,,,,
AMC-020,Stanford,,,Female,,Former,27,1986,13,1973,Adenocarcinoma,,,,,,,,,Wildtype,Wildtype,Wildtype,yes,Yes,,no,,,,,1/16/1997,,Alive,,,12/3/1994,,,,,
AMC-021,Stanford,,,Female,,Former,20,1987,13,1974,Adenocarcinoma,,,,,,,,,Wildtype,Mutant,Wildtype,no,,,no,,,,,12/31/1996,,Alive,,,4/27/1994,,,,,
AMC-022,Stanford,,,Female,,Former,15,1983,13,1970,Adenocarcinoma,,,,,,,,,Mutant,Wildtype,Wildtype,no,,,no,,,,,4/17/1996,,Alive,,,9/1/1993,,,,,
AMC-023,Stanford,,,Female,,Nonsmoker,,,,0,Adenocarcinoma,,,,,,,,,Mutant,Wildtype,Wildtype,no,,,no,,,,,12/31/1996,,Alive,,,3/9/1995,,,,,
AMC-024,Stanford,,,Female,,Former,30,2000,13,1987,Adenocarcinoma,,,,,,,,,Wildtype,Wildtype,Wildtype,no,,,no,,,,,10/3/1996,,Alive,,,9/1/1994,,,,,
AMC-025,Stanford,,,Female,,Former,,1970,13,1957,Adenocarcinoma,,,,,,,,,Wildtype,Wildtype,Wildtype,no,,,no,,,,,1/1/1997,,Alive,,,8/6/1994,,,,,
AMC-026,Stanford,,,Female,,Nonsmoker,,,,0,Adenocarcinoma,,,,,,,,,Wildtype,Mutant,Unknown,no,,,no,,,,,1/2/1997,,Alive,,,1/6/1993,,,,,
AMC-027,Stanford,,,Female,,Former,30,2000,13,1987,Adenocarcinoma,,,,,,,,,Mutant,Wildtype,Wildtype,no,,,no,,,,,10/5/1996,,Alive,,,4/28/1994,,,,,
AMC-028,Stanford,,,Female,,Former,,1993,13,1980,Adenocarcinoma,,,,,,,,,Wildtype,Mutant,Not collected,no,,,no,,,,,2/21/1995,,Alive,,,9/17/1992,,,,,
AMC-029,Stanford,,,Male,,Former,60,1973,13,1960,Adenocarcinoma,,,,,,,,,Wildtype,Wildtype,Wildtype,no,,,no,,,,,1/16/1997,,Alive,,,9/8/1994,,,,,
AMC-030,Stanford,,,Female,,Nonsmoker,,,,0,Adenocarcinoma,,,,,,,,,Mutant,Wildtype,Wildtype,no,,,no,,,,,9/11/1996,,Alive,,,8/20/1994,,,,,
AMC-031,Stanford,,,Male,,Nonsmoker,,,,0,Adenocarcinoma,,,,,,,,,Wildtype,Wildtype,Wildtype,no,,,no,,,,,9/25/1996,,Alive,,,1/15/1993,,,,,
AMC-032,Stanford,,,Female,,Nonsmoker,,,,0,Adenocarcinoma,,,,,,,,,Mutant,Wildtype,Wildtype,no,,,no,,,,,12/4/1996,,Alive,,,9/22/1993,,,,,
AMC-033,Stanford,,,Male,,Nonsmoker,,,,0,Adenocarcinoma,,,,,,,,,Unknown,Wildtype,Wildtype,no,,,no,,,,,5/18/1994,,Alive,,,12/22/1993,,,,,
AMC-034,Stanford,,,Male,,Nonsmoker,,,,0,Adenocarcinoma,,,,,,,,,Mutant,Wildtype,Wildtype,no,,,yes,distant,RUL,12/29/1994,CT,9/6/1996,,Alive,,,1/28/1994,,,,,
AMC-035,Stanford,,,Male,,Nonsmoker,,,,0,Adenocarcinoma,,,,,,,,,Wildtype,Wildtype,Wildtype,no,,,no,,,,,12/17/1996,,Alive,,,5/6/1994,,,,,
AMC-036,Stanford,,,Female,,Nonsmoker,,,,0,Adenocarcinoma,,,,,,,,,Mutant,Wildtype,Wildtype,no,,,no,,,,,8/7/1996,,Alive,,,1/17/1995,,,,,
AMC-037,Stanford,,,Female,,Former,2,1974,13,1961,Adenocarcinoma,,,,,,,,,Wildtype,Wildtype,Not collected,yes,Yes,Yes,no,,,,,8/27/1996,,Alive,,,7/6/1992,,,,,
AMC-038,Stanford,,,Female,,Nonsmoker,,,,0,Adenocarcinoma,,,,,,,,,Mutant,Wildtype,Wildtype,yes,Yes,,yes,distant,"Bone, brain, LN, mediastinum",3/18/1995,CT,8/2/1996,,Dead,8/2/1996,,5/21/1994,,,,,
AMC-039,Stanford,,,Male,,Former,50,1990,13,1977,Adenocarcinoma,,,,,,,,,Wildtype,Wildtype,Wildtype,no,,,yes,regional,LN,8/23/1995,PET,11/10/1995,,Alive,,,4/28/1994,,,,,
AMC-040,Stanford,,,Female,,Nonsmoker,,,,0,Adenocarcinoma,,,,,,,,,Wildtype,Wildtype,Wildtype,yes,Yes,,no,,,,,1/9/1997,,Alive,,,11/10/1993,,,,,
AMC-041,Stanford,,,Female,,Nonsmoker,,,,0,Adenocarcinoma,,,,,,,,,Mutant,Wildtype,Wildtype,no,,,no,,,,,11/6/1996,,Alive,,,2/25/1994,,,,,
AMC-042,Stanford,,,Male,,Nonsmoker,,,,0,Adenocarcinoma,,,,,,,,,Mutant,Wildtype,Wildtype,no,,,no,,,,,1/18/1997,,Alive,,,1/14/1994,,,,,
AMC-043,Stanford,,,Male,,Former,45,1999,13,1986,Adenocarcinoma,,,,,,,,,Unknown,Wildtype,Wildtype,unknown,,,unknown,,,,,7/30/1994,,Alive,,,6/23/1994,,,,,
AMC-044,Stanford,,,Female,,Nonsmoker,,,,0,Adenocarcinoma,,,,,,,,,Mutant,Wildtype,Wildtype,no,,,yes,local,Along fissure of LUL surgical site,11/12/1994,CT,10/19/1996,,Alive,,,11/12/1994,,,,,
AMC-045,Stanford,,,Female,,Nonsmoker,,,,0,Adenocarcinoma,,,,,,,,,Mutant,Wildtype,Not collected,no,,,no,,,,,1/17/1997,,Alive,,,5/12/1992,,,,,
AMC-046,Stanford,,,Female,,Former,46,1996,13,1983,Adenocarcinoma,,,,,,,,,Wildtype,Wildtype,Wildtype,no,,,no,,,,,8/21/1994,,Alive,,,1/12/1994,,,,,
AMC-047,Stanford,,,Female,,Former,50,2011,13,1998,Adenocarcinoma,,,,,,,,,Wildtype,Wildtype,Wildtype,no,,,no,,,,,11/8/1996,,Alive,,,9/13/1994,,,,,
AMC-048,Stanford,,,Male,,Former,30,1997,13,1984,Adenocarcinoma,,,,,,,,,Not collected,Wildtype,Wildtype,no,,,no,,,,,11/18/1994,,Dead,11/18/1994,,8/28/1993,,,,,
AMC-049,Stanford,,,Male,,Former,30,1980,13,1967,Adenocarcinoma,,,,,,,,,Wildtype,Wildtype,Not collected,unknown,,,unknown,,,,,9/4/1991,,Alive,,,8/9/1991,,,,,
R01-001,Stanford,79,146,Female,Caucasian,Former,37,1985,13,1972,Adenocarcinoma,,T1a,N0,M0,IA,G2 Moderately differentiated,Absent,No,Unknown,Unknown,Unknown,no,No,No,no,,,,,8/8/1997,2486,Alive,,,9/6/1990,10/17/1990,2.66,1.83,,
R01-002,Stanford,65,195,Female,Asian,Nonsmoker,,,,0,Adenocarcinoma,,T1a,N0,M0,IA,G1 Well differentiated,Absent,No,Unknown,Unknown,Unknown,no,No,No,no,,,,,11/29/1990,47,Alive,,,9/20/1990,10/11/1990,11.49,6.8,,
R01-003,VA,65,,Male,Caucasian,Current,38,,,0,Adenocarcinoma,,T3,N0,M0,IIB,"Other, Type I: Well to moderately differentiated",Absent,No,Mutant,Mutant,Wildtype,no,No,No,no,,,,,6/11/1992,159,Alive,,,12/10/1991,12/19/1991,1.21,0.87,,
R01-004,VA,67,,Male,Caucasian,Former,10,1983,13,1970,Squamous cell carcinoma,,T1b,N2,M0,IIIA,G2 Moderately differentiated,Absent,No,Wildtype,Wildtype,Wildtype,yes,Yes,Yes,yes,distant,Pleura,9/29/1993,PET,11/24/1994,1083,Alive,,,9/9/1991,10/17/1991,3.13,2.08,,
R01-005,Stanford,84,145,Male,Native Hawaiian/Pacific Islander,Former,20,1969,13,1956,Adenocarcinoma,,T2a,N0,M0,IB,G3 Poorly differentiated,Absent,No,Wildtype,Unknown,Wildtype,no,No,Yes,yes,distant,Brain,1/19/1993,MRI,6/3/1995,1456,Dead,6/3/1995,1456,3/8/1991,4/19/1991,10.62,8.59,8.35,6.76
R01-006,VA,62,,Male,Caucasian,Former,?,?,,,Adenocarcinoma,,T1b,N0,M0,IA,G1 Well differentiated,Absent,No,Wildtype,Wildtype,Wildtype,no,No,No,no,,,,,4/20/1997,1982,Alive,,,1/5/1991,11/7/1991,1.65,0.97,,
R01-007,VA,68,,Male,Caucasian,Former,15,1986,13,1973,Squamous cell carcinoma,,T1a,N1,M0,IIA,G3 Poorly differentiated,Absent,No,Wildtype,Wildtype,Wildtype,yes,Yes,No,yes,local,LUL,1/6/1994,CT,9/29/1994,1048,Dead,9/29/1994,1048,10/16/1991,10/16/1991,3.78,3.18,,
R01-008,Stanford,73,102,Male,Caucasian,Nonsmoker,,,,0,Adenocarcinoma,,Tis,N0,M0,0,G1 Well differentiated,Absent,No,Wildtype,Mutant,Unknown,no,No,No,no,,,,,8/8/1997,2264,Alive,,,4/24/1991,5/11/1991,1.65,1.31,,
R01-009,VA,59,133,Male,Caucasian,Current,100,,,0,Adenocarcinoma,,T1a,N0,M0,IA,G3 Poorly differentiated,Absent,No,Wildtype,Wildtype,Wildtype,no,No,No,no,,,,,9/28/1994,1344,Dead,9/28/1994,1344,11/25/1990,12/8/1990,1.7,1.44,,
R01-010,VA,72,,Male,Caucasian,Former,60,2003,13,1990,Squamous cell carcinoma,,T3,N0,M0,IIB,G2 Moderately differentiated,Absent,Yes,Wildtype,Wildtype,Wildtype,no,No,Yes,yes,regional,LN,12/19/1990,PET,9/28/1994,1425,Alive,,,9/12/1990,10/12/1990,30.21,22.61,26.75,20.03
R01-011,Stanford,65,90,Female,Asian,Nonsmoker,,,,0,Squamous cell carcinoma,,T1a,N2,M0,IIIA,G3 Poorly differentiated,Absent,No,Unknown,Unknown,Unknown,yes,Yes,No,no,,,,,8/21/1997,2442,Alive,,,9/4/1990,11/17/1990,9.61,7.39,7.62,5.86
R01-012,Stanford,70,125,Female,Caucasian,Nonsmoker,,,,0,Adenocarcinoma,,T2a,N0,M0,IB,G2 Moderately differentiated,Absent,Yes,Wildtype,Unknown,Unknown,yes,Yes,Yes,yes,distant,"LLL, RLL",10/27/1993,CT,8/29/1997,2381,Alive,,,11/23/1990,12/22/1990,3.24,2.41,2.64,1.96
R01-013,Stanford,46,176,Female,Asian,Former,15,1992,13,1979,Adenocarcinoma,,T2a,N0,M0,IB,G2 Moderately differentiated,Absent,Yes,Unknown,Unknown,Unknown,no,No,No,no,,,,,8/29/1997,2740,Alive,,,11/7/1989,1/13/1990,7.5,4.89,,
R01-014,Stanford,52,130,Female,Caucasian,Former,1,1985,13,1972,Adenocarcinoma,,Tis,N0,M0,0,G1 Well differentiated,Absent,No,Unknown,Unknown,Unknown,no,No,No,no,,,,,3/7/1997,1907,Alive,,,12/3/1991,12/10/1991,2.38,1.82,,
R01-015,VA,74,,Male,Caucasian,Nonsmoker,,,,0,Adenocarcinoma,,T2a,N0,M0,IIA,G3 Poorly differentiated,Absent,Yes,Wildtype,Wildtype,Wildtype,no,No,No,no,,,,,5/26/1992,430,Dead,5/26/1992,430,2/9/1991,12/11/1990,10.6,9.01,9.89,8.35
R01-016,VA,64,195,Male,African-American,Current,?,,,0,Adenocarcinoma,,T1a,N0,M0,IA,G2 Moderately differentiated,Absent,No,Wildtype,Wildtype,Wildtype,no,No,Yes,yes,distant,R hilar mass,11/23/1991,PET,8/14/1997,2378,Alive,,,10/16/1990,11/3/1990,3.07,2.46,,
R01-017,Stanford,77,175,Male,Caucasian,Former,20,1984,13,1971,Adenocarcinoma,,T1a,N0,M0,IA,G1 Well differentiated,Absent,No,Unknown,Unknown,Unknown,no,No,No,no,,,,,2/15/1993,474,Dead,2/15/1993,474,10/25/1991,8/14/1991,0.99,0.76,,
R01-018,VA,67,,Male,Caucasian,Former,10,1959,13,1946,Squamous cell carcinoma,,T4,N0,M0,IIIA,G3 Poorly differentiated,Absent,Yes,Wildtype,Wildtype,Unknown,yes,Yes,Yes,yes,distant,"Chest wall, diaphragm",1/19/1992,CT,7/9/1994,1176,Dead,7/9/1994,1176,1/6/1991,1/23/1991,2.87,2.17,2.26,1.71
R01-019,VA,71,205,Male,Caucasian,Former,42,1992,13,1979,Adenocarcinoma,,T1b,N0,M0,IA,G2 Moderately differentiated,Absent,No,Wildtype,Mutant,Wildtype,no,No,No,no,,,,,11/16/1990,6,Dead,11/16/1990,6,9/29/1990,10/18/1990,6.25,4.67,,
R01-020,Stanford,63,152,Female,Caucasian,Nonsmoker,,,,0,Adenocarcinoma,,T3,N0,M0,IIB,G2 Moderately differentiated,Absent,No,Wildtype,Unknown,Unknown,no,No,No,no,,,,,11/28/1996,1799,Alive,,,7/17/1991,12/21/1991,5.86,3.86,2.86,1.8
R01-021,Stanford,61,149,Female,Asian,Nonsmoker,,,,0,Adenocarcinoma,,T1a,N0,M0,IA,G2 Moderately differentiated,Absent,No,Unknown,Unknown,Unknown,no,No,No,no,,,,,4/22/1997,2139,Alive,,,12/5/1990,6/11/1991,3.66,2.21,,
R01-022,VA,62,,Male,African-American,Nonsmoker,,,,0,Adenocarcinoma,,Tis,N0,M0,IA,G2 Moderately differentiated,Absent,No,Unknown,Wildtype,Unknown,no,No,No,no,,,,,8/16/1997,2499,Alive,,,8/5/1990,9/14/1990,2.68,1.94,,
R01-023,VA,81,,Male,Native Hawaiian/Pacific Islander,Former,10,2003,13,1990,Adenocarcinoma,,Tis,N0,M0,IA,G2 Moderately differentiated,Absent,No,Wildtype,Wildtype,Wildtype,no,No,No,no,,,,,3/25/1994,993,Alive,,,4/20/1991,5/7/1991,9.35,6.67,7.47,5.33
R01-024,VA,52,169,Male,Caucasian,Current,53,,,0,Adenocarcinoma,,T2a,N0,M0,IIA,G1 Well differentiated,Absent,Yes,Unknown,Mutant,Unknown,no,No,Yes,yes,distant,Brain,5/15/1992,MRI,8/10/1992,366,Dead,8/10/1992,366,3/8/1991,3/23/1991,8.09,6.67,,
R01-025,VA,68,,Male,Caucasian,Current,40,,,0,Adenocarcinoma,,T2a,N0,M0,IIA,G1 Well differentiated,Absent,No,Wildtype,Unknown,Wildtype,no,No,No,no,,,,,11/28/1992,623,Alive,,,12/19/1990,1/30/1991,2.62,2.24,2.24,1.91
R01-026,Stanford,59,158,Male,Asian,Nonsmoker,,,,0,Adenocarcinoma,,T1b,N0,M0,IA,G2 Moderately differentiated,Absent,No,Mutant,Wildtype,Wildtype,yes,Yes,Yes,yes,distant,"Adrenal gland, Brain",4/10/1991,,6/17/1997,2356,Dead,6/17/1997,2356,11/13/1990,11/28/1990,7,5.68,,
R01-027,VA,76,152.145,Male,Caucasian,Former,50,2011,13,1998,NSCLC NOS (not otherwise specified),,T4,N0,M0,IIIA,G3 Poorly differentiated,Present,Yes,Wildtype,Wildtype,Wildtype,no,No,No,no,,,,,9/17/1993,34,Alive,,,7/21/1993,7/20/1993,22.53,18.1,14.59,11.72
R01-028,VA,67,189.63,Male,Caucasian,Former,80,2004,13,1991,Adenocarcinoma,,T2a,N0,M0,IB,G3 Poorly differentiated,Absent,Yes,Wildtype,Mutant,Wildtype,no,No,No,no,,,,,8/26/1997,1459,Alive,,,8/5/1993,7/10/1993,9.53,7.35,7.85,6.05
R01-029,Stanford,76,249.165,Male,Caucasian,Former,60,1981,13,1968,NSCLC NOS (not otherwise specified),,T3,N2,M0,IIIA,G2 Moderately differentiated,Present,No,Wildtype,Mutant,Wildtype,yes,Yes,No,yes,distant,"Adrenal, Bone",10/6/1993,CT,6/15/1994,286,Dead,6/15/1994,286,7/31/1993,8/7/1993,11.49,16.54,9.89,14.24
R01-030,VA,86,189.63,Male,Caucasian,Former,30,1986,13,1973,Adenocarcinoma,,T1a,N2,M0,IIIA,G1 Well differentiated,Absent,No,Wildtype,Unknown,Unknown,no,No,No,yes,distant,"Bone, LN, R lung",2/26/1993,PET,4/27/1993,360,Dead,4/27/1993,360,3/18/1992,4/2/1992,2.48,1.96,,
R01-031,VA,64,160.965,Male,Hispanic/Latino,Former,46,2003,13,1990,NSCLC NOS (not otherwise specified),,T1b,N0,M0,IA,G3 Poorly differentiated,Absent,No,Wildtype,Wildtype,Wildtype,no,No,Yes,yes,local,RLL,1/5/1995,CT,8/16/1997,1890,Alive,,,5/21/1992,5/21/1992,4.3,3.48,,
R01-032,VA,63,134.505,Male,Caucasian,Former,20,1996,13,1983,Adenocarcinoma,,T2a,N0,M0,IB,"Other, Type II: Moderately to poorly differentiated",Absent,Yes,Wildtype,Wildtype,Wildtype,no,No,No,no,,,,,11/3/1994,852,Alive,,,4/5/1992,5/29/1992,10.79,9.23,8.85,7.57
R01-033,VA,69,185.22,Male,Caucasian,Former,35,1993,13,1980,Adenocarcinoma,,T1b,N2,M0,IIIA,"Other, Type I: Well to moderately differentiated",Absent,No,Unknown,Unknown,Unknown,no,No,No,yes,regional,LN,11/13/1992,PET,12/7/1993,514,Dead,12/7/1993,514,6/27/1992,6/27/1992,1.32,1.05,,
R01-034,VA,64,180.81,Male,Hispanic/Latino,Nonsmoker,,,,0,Adenocarcinoma,,T2a,N1,M0,IIA,G2 Moderately differentiated,Absent,Yes,Wildtype,Wildtype,Wildtype,yes,Yes,No,no,,,,,8/27/1997,1839,Alive,,,5/31/1992,7/4/1992,7.26,5.52,5.73,4.35
R01-035,VA,78,216.09,Male,Caucasian,Current,90,,,0,Adenocarcinoma,,T2a,N2,M0,IIIA,G1 Well differentiated,Absent,No,Wildtype,Wildtype,Wildtype,yes,Yes,No,yes,local,RLL & LN,9/9/1993,PET,9/5/1997,1798,Alive,,,9/17/1992,9/23/1992,9.38,7.02,7.14,5.35
R01-036,VA,43,317.52,Male,Caucasian,Former,?,1961,13,1948,Adenocarcinoma,,T3,N2,M0,IIIA,G3 Poorly differentiated,Present,Yes,Wildtype,Wildtype,Unknown,yes,Yes,Yes,yes,distant,"Liver, Omentum",11/3/1994,CT,1/8/1995,792,Dead,1/8/1995,792,10/15/1992,10/8/1992,11.12,6.3,9.39,5.32
R01-037,VA,84,187.425,Male,Caucasian,Former,10,1954,13,1941,Adenocarcinoma,,T2a,N0,M0,IB,"Other, Type II: Moderately to poorly differentiated",Absent,Yes,Mutant,Wildtype,Wildtype,unknown,No,No,unknown,,,,,12/11/1992,20,Alive,,,11/18/1992,11/18/1992,6.71,5.27,,
R01-038,VA,59,216.09,Male,Caucasian,Former,80,2010,13,1997,Squamous cell carcinoma,,T2a,N0,M0,IB,G2 Moderately differentiated,Absent,No,Wildtype,Wildtype,Wildtype,no,No,No,no,,,,,10/30/1993,133,Alive,,,3/30/1993,4/7/1993,4.16,3.12,,
R01-039,VA,78,198.45,Male,Caucasian,Former,54,2010,13,1997,Squamous cell carcinoma,,T1b,N0,M0,IA,G1 Well differentiated,Absent,No,Unknown,Unknown,Unknown,no,No,No,no,,,,,6/3/1993,41,Alive,,,2/18/1993,3/2/1993,9.1,6.91,,
R01-040,VA,64,211.68,Male,Caucasian,Former,30,2010,13,1997,Squamous cell carcinoma,,T2a,N0,M0,IB,G2 Moderately differentiated,Present,No,Wildtype,Wildtype,Wildtype,no,No,No,no,,,,,8/27/1997,2041,Alive,,,1/15/1992,1/10/1992,4.88,3.73,4.16,3.18
R01-041,VA,57,288.855,Female,Caucasian,Former,10,1953,13,1940,Squamous cell carcinoma,,T1a,N0,M0,IA,G2 Moderately differentiated,Absent,No,Wildtype,Wildtype,Wildtype,no,No,No,no,,,,,7/23/1997,1733,Alive,,,9/7/1992,10/3/1992,3.56,1.55,,
R01-042,VA,76,178.605,Male,African-American,Current,50,,,0,Squamous cell carcinoma,,T2b,N0,M0,IIA,"Other, Type I: Well to moderately differentiated",Absent,No,Unknown,Unknown,Unknown,no,No,No,no,,,,,7/11/1992,42,Dead,7/11/1992,42,5/29/1992,5/28/1992,22.81,17.68,19.76,15.32
R01-043,VA,81,174.195,Male,African-American,Former,25,?,,,Adenocarcinoma,,T1a,N0,M0,IA,G2 Moderately differentiated,Absent,No,Wildtype,Mutant,Wildtype,no,No,No,no,,,,,2/18/1993,79,Alive,,,8/21/1992,9/23/1992,2.65,2.12,,
R01-044,VA,72,167.58,Male,Caucasian,Former,120,2010,13,1997,Adenocarcinoma,,T1a,N0,M0,IA,G2 Moderately differentiated,,No,Wildtype,Wildtype,Wildtype,no,No,No,no,,,,,8/16/1997,1694,Alive,,,10/6/1992,10/31/1992,2.53,2.1,,
R01-045,VA,66,145.53,Male,Caucasian,Former,50,2003,13,1990,Adenocarcinoma,,T1a,N0,M0,IA,G2 Moderately differentiated,Present,No,Wildtype,Mutant,Wildtype,no,No,No,no,,,,,8/12/1997,1662,Alive,,,1/14/1993,1/19/1993,2.21,1.81,,
R01-046,VA,66,200.655,Male,Caucasian,Former,75,2007,13,1994,Squamous cell carcinoma,,T1b,N0,M0,IA,G2 Moderately differentiated,Absent,No,Wildtype,Wildtype,Wildtype,no,No,No,no,,,,,6/5/1997,1370,Alive,,,6/17/1993,5/26/1993,12.38,9.58,,
R01-047,VA,87,160.965,Male,Caucasian,Former,50,1996,13,1983,Adenocarcinoma,,T2a,N0,M0,IB,G1 Well differentiated,Absent,Yes,Mutant,Wildtype,Wildtype,no,No,No,no,,,,,7/16/1997,1383,Alive,,,8/11/1993,9/8/1993,7.2,5.8,,
R01-048,Stanford,77,185.22,Male,Caucasian,Former,8,1963,13,1950,Adenocarcinoma,,T1b,N0,M0,IA,G2 Moderately differentiated,Absent,No,Wildtype,Wildtype,Wildtype,no,No,No,no,,,,,8/20/1997,1510,Alive,,,4/30/1993,5/29/1993,6.46,5.22,,
R01-049,Stanford,70,174.195,Female,Caucasian,Current,25,,,0,Squamous cell carcinoma,,T1a,N0,M0,IA,G2 Moderately differentiated,Absent,No,Unknown,Unknown,Unknown,no,No,No,no,,,,,11/26/1996,1236,Alive,,,6/9/1993,6/23/1993,7.7,5.21,5.44,3.69
R01-050,Stanford,73,127.89,Female,Caucasian,Current,50,,,0,Adenocarcinoma,,T1a,N0,M0,IA,G2 Moderately differentiated,Absent,No,Wildtype,Wildtype,Wildtype,no,No,No,yes,distant,R hilum,12/23/1995,CT,1/29/1997,1258,Dead,1/29/1997,1258,7/30/1993,7/30/1993,6.53,4.8,,
R01-051,Stanford,70,202.86,Male,Caucasian,Nonsmoker,,,,0,Adenocarcinoma,,T1b,N1,M0,IIA,G2 Moderately differentiated,Present,No,Wildtype,Wildtype,Wildtype,no,No,No,yes,distant,Bone,5/3/1994,PET,6/5/1994,261,Dead,6/5/1994,261,9/11/1993,9/11/1993,5.7,3.87,4.71,3.2
R01-052,VA,75,185.22,Male,Caucasian,Nonsmoker,,,,0,Adenocarcinoma,,T2a,N0,M0,IB,G1 Well differentiated,Absent,No,Unknown,Unknown,Unknown,no,No,No,unknown,,,,,11/20/1993,35,Alive,,,7/15/1993,8/6/1993,0.72,1.34,,
R01-053,VA,62,127.89,Male,African-American,Current,34,,,0,Adenocarcinoma,,T1a,N0,M0,IA,G3 Poorly differentiated,Absent,No,Wildtype,Mutant,Wildtype,no,No,No,unknown,,,,,11/20/1993,32,Alive,,,9/3/1993,9/7/1993,6.3,5.47,,
R01-054,VA,56,220.5,Male,Caucasian,Current,25,,,0,Adenocarcinoma,,T3,N1,M0,IIIA,G2 Moderately differentiated,Absent,No,Wildtype,Mutant,Wildtype,yes,Yes,No,no,,,,,9/4/1997,1405,Alive,,,10/3/1993,10/9/1993,36.73,24.79,32.61,22
R01-055,VA,69,200.655,Male,Caucasian,Former,54,12-Feb,13,,Squamous cell carcinoma,,T1a,N0,M0,IA,G2 Moderately differentiated,,No,Wildtype,Wildtype,Wildtype,no,No,No,no,,,,,1/14/1997,1165,Dead,1/14/1997,1165,8/12/1993,8/25/1993,11.67,8.9,,
R01-056,VA,71,180.81,Male,Caucasian,Former,22,1992,13,1979,Adenocarcinoma,,T2a,N1,M0,IIA,"Other, Type I: Well to moderately differentiated",Present,Yes,Mutant,Wildtype,Wildtype,unknown,No,No,no,,,,,12/2/1993,20,Alive,,,11/3/1993,10/30/1993,9.19,7.09,7.75,5.98
R01-057,VA,65,185.22,Male,Caucasian,Current,30,,,0,Adenocarcinoma,,T1a,N0,M0,IA,G2 Moderately differentiated,Absent,No,Wildtype,Wildtype,Wildtype,no,No,No,no,,,,,12/10/1996,1123,Dead,12/10/1996,1123,10/14/1993,10/12/1993,1.19,1,,
R01-058,VA,63,145.53,Male,Asian,Nonsmoker,,,,0,Adenocarcinoma,,T1b,N0,M0,IA,"Other, Type I: Well to moderately differentiated",Absent,No,Mutant,Wildtype,Wildtype,unknown,No,No,unknown,,,,,12/18/1993,28,Alive,,,7/13/1993,8/18/1993,2.66,2.08,,
R01-059,VA,67,160.965,Male,Caucasian,Former,60,2002,13,1989,Adenocarcinoma,,T1a,N1,M0,IA,G2 Moderately differentiated,Present,No,Wildtype,Mutant,Wildtype,yes,Yes,No,no,,,,,8/12/1997,1354,Alive,,,6/3/1993,8/5/1993,1.24,1,,
R01-060,VA,53,156.555,Female,Caucasian,Current,35,,,0,Adenocarcinoma,,T4,N0,M0,IIIA,G2 Moderately differentiated,Absent,No,Wildtype,Wildtype,Wildtype,yes,Yes,No,no,,,,,9/3/1997,1369,Alive,,,9/21/1993,11/6/1993,0.94,0.65,,
R01-061,VA,67,200.655,Male,Caucasian,Former,43,2010,13,1997,Adenocarcinoma,,T1b,N0,M0,IA,"Other, Type II: Moderately to poorly differentiated",Absent,No,Wildtype,Wildtype,Wildtype,unknown,No,No,unknown,,,,,1/21/1994,20,Alive,,,9/23/1993,11/12/1993,7.49,5.34,,
R01-062,VA,72,200.655,Male,Caucasian,Former,80,2003,13,1990,Adenocarcinoma,,T1a,N0,M0,IA,"Other, Type II: Moderately to poorly differentiated",Absent,No,Wildtype,Mutant,Wildtype,no,No,No,no,,,,,9/28/1996,973,Alive,,,12/22/1993,1/12/1994,3.48,2.72,,
R01-063,VA,65,209.475,Male,Caucasian,Former,40,2009,13,1996,Adenocarcinoma,,T2a,N0,M0,IB,G3 Poorly differentiated,Absent,Yes,Wildtype,Wildtype,Wildtype,yes,Yes,No,no,,,,,3/16/1997,1135,Alive,,,12/3/1993,1/1/1994,7.81,5.99,5.74,4.4
R01-064,VA,81,147.735,Male,Hispanic/Latino,Current,34,,,0,Squamous cell carcinoma,,T1a,N0,M0,IA,G2 Moderately differentiated,Absent,No,Wildtype,Wildtype,Wildtype,no,No,No,no,,,,,8/17/1997,1282,Alive,,,1/15/1994,12/30/1993,2.24,1.83,,
R01-065,VA,80,194.04,Male,Caucasian,Former,38,?,,,Squamous cell carcinoma,,T2b,N2,M0,IIIA,G2 Moderately differentiated,Absent,No,Wildtype,Wildtype,Wildtype,yes,Yes,No,yes,distant,Adrenal,11/23/1994,PET,1/31/1995,346,Dead,1/31/1995,346,2/5/1994,12/29/1993,17.92,13.53,16.21,12.24