PatientID,Carcinoma.Laterality,GTV1,GTV2,GTV3,GTV4,GTV5,GTV6,Tumor.Location,Effusion.Event,Primary.Effusion.Reviewer,Secondary.Effusion.Reviewer,Tertiary.Effusion.Reviewer,Right.Pleural.Effusion.Volume,Left.Pleural.Effusion.Volume,RO1-Rad4.Effusion.DSC,Rad3-Rad4.Effusion.DSC,RO1-Rad3.Effusion.DSC,Thorax.Recontour.Time,Auto-MS.Thorax.DSC,Primary.Thorax.Reviewer,Secondary.Thorax.Reviewer,Right.Thorax.Volume,Left.Thorax.Volume,RO1-RO3.Thorax.DSC,Rad1-Rad3.Thorax.DSC,Rad1-Rad2.Thorax.DSC,RO2-Rad2.Thorax.DSC,Dim.x,Dim.y,Dim.z,Voxel.Space.x,Voxel.Space.y,Voxel.space.z
LUNG1-001,L,139.06,,,,,,3,1,Rad4,Rad3,,182.2,,,0.892902591,,,0.959024841,RO1,,3060,2780,,,,,512,512,134,0.976563,0.976563,3
LUNG1-002,R,340.3,,,,,,3,1,Rad4,Rad3,RO1,113.7,,0.896380938,0.777584748,0.790751651,,0.918989464,RO1,,2480,1920,,,,,512,512,111,0.977,0.977,3
LUNG1-003,,,,,,,,,,,,,,,,,,,,,,,,,,,,,,,,,
LUNG1-004,L,86.5,7.06,70.38,,,,3,0,,,,,,,,,,0.94386141,RO1,RO3,2730,2420,0.978431309,,,,512,512,114,0.976563,0.976563,3
LUNG1-005,R,78.62,,,,,,1,1,Rad4,Rad3,RO1,128.5,,0.25890968,0.409616952,0.101639413,,0.991355271,RO1,,1910,1800,,,,,512,512,91,0.977,0.977,3
LUNG1-006,L,75.9,,,,,,1,0,,,,,,,,,,0.999990358,RO1,,3680,2710,,,,,512,512,114,0.977,0.977,3
LUNG1-007,R,9.62,15.38,,,,,1,0,,,,,,,,,,0.9963635,RO1,,2090,1560,,,,,512,512,129,0.976563,0.976563,3
LUNG1-008,R,37.48,,,,,,3,1,Rad4,Rad3,,65.3,,,0.567913364,,,0.994065859,RO1,,1360,1290,,,,,512,512,114,0.977,0.977,3
LUNG1-009,R,91.85,32.48,37.24,83.87,,,3,0,,,,,,,,,,0.994848792,RO1,RO3,1620,2130,0.989763363,,,,512,512,105,0.977,0.977,3
LUNG1-010,R,15.5,5.72,,,,,1,0,,,,,,,,,,0.996624358,RO1,,1710,1750,,,,,512,512,91,0.977,0.977,3
LUNG1-011,R,71.65,,,,,,3,0,,,,,,,,,,0.994718585,RO1,,2080,1760,,,,,512,512,88,0.977,0.977,3
LUNG1-012,R,250.23,18,,,,,3,0,,,,,,,,,,0.989899248,RO1,,2980,2480,,,,,512,512,109,0.977,0.977,3
LUNG1-013,L,13.25,,,,,,1,1,Rad4,Rad3,,2.64,,,0.492463289,,,0.994558453,RO1,,2940,2200,,,,,512,512,134,0.976563,0.976563,3
LUNG1-014,,,,,,,,,,,,,,,,,,,,,,,,,,,,,,,,,
LUNG1-015,R,3.05,,,,,,2,0,,,,,,,,,,0.998460215,RO1,RO3,2810,2300,0.998722966,,,,512,512,117,0.898,0.898,3
LUNG1-016,R,107.91,,,,,,3,1,Rad4,Rad3,RO1,130.6,,0.931758559,0.883283618,0.889047772,,0.936299192,RO1,,1940,1770,,,,,512,512,82,0.977,0.977,3
LUNG1-017,R,218.78,18.98,2.72,,,,3,0,,,,,,,,,,0.937432677,RO1,,2020,1940,,,,,512,512,123,0.977,0.977,3
LUNG1-018,R,142.26,4.58,,,,,2,1,Rad4,Rad3,RO1,59.61,,0.815296367,0.71816229,0.861043835,,0.973210137,RO1,RO3,2420,1770,0.989256377,,,,512,512,114,0.977,0.977,3
LUNG1-019,L,105.2,,,,,,3,0,,,,,,,,,,0.977310685,RO1,,2960,2390,,,,,512,512,101,0.812,0.812,3
LUNG1-020,R,82.79,12.41,10.4,13.48,,,3,0,,,,,,,,,,0.94982556,RO1,,3490,2620,,,,,512,512,108,0.977,0.977,3
LUNG1-021,,,,,,,,,,,,,,,,,,,,,,,,,,,,,,,,,
LUNG1-022,L,44.04,,,,,,3,0,,,,,,,,,,0.966128518,RO1,,2180,2040,,,,,512,512,121,0.977,0.977,3
LUNG1-023,R,653.66,13.1,,,,,3,0,,,,,,,,,,0.934896894,RO1,,3280,2800,,,,,512,512,126,0.977,0.977,3
LUNG1-024,R,7.91,7.41,,,,,2,1,Rad4,Rad3,RO1,72.09,667.3,0.963918196,0.864501518,0.88540986,13.5,0.859905637,RO1,,2000,1670,,,,,512,512,95,0.977,0.977,3
LUNG1-025,R,100.98,,,,,,3,0,,,,,,,,,11.97,0.969192279,RO1,,2350,1990,,,,,512,512,106,0.977,0.977,3
LUNG1-026,R,179.92,23.88,,,,,1,1,Rad4,Rad3,RO1,511.6,31.4,0.987423906,0.963537356,0.959041252,,0.921819275,RO1,RO3,2360,1710,0.963997315,,,,512,512,110,0.977,0.977,3
LUNG1-027,R,0.46,,,,,,1,0,,,,,,,,,,0.991921794,RO1,,3220,2540,,,,,512,512,108,0.977,0.977,3
LUNG1-028,R,15.25,,,,,,2,1,Rad4,Rad3,RO1,46.2,,0.810987409,0.665866603,0.654523619,,0.947484898,RO1,,2550,1840,,,,,512,512,102,0.977,0.977,3
LUNG1-029,L,40.77,5.18,,,,,1,0,,,,,,,,,,0.942404861,RO1,,1870,1430,,,,,512,512,131,0.976563,0.976563,3
LUNG1-030,R,75.18,,,,,,1,0,,,,,,,,,,0.982527832,RO1,,2240,2460,,,,,512,512,94,0.977,0.977,3
LUNG1-031,,,,,,,,,,,,,,,,,,,,,,,,,,,,,,,,,
LUNG1-032,R,74.74,,,,,,3,0,,,,,,,,,,0.83091759,RO1,,2860,3470,,,,,512,512,117,0.976563,0.976563,3
LUNG1-033,R,148.02,12.8,3.93,,,,1,0,,,,,,,,,,0.994804665,RO1,RO3,3320,3290,0.989446327,,,,512,512,113,0.977,0.977,3
LUNG1-034,L,100.36,,,,,,3,0,,,,,,,,,,0.983818836,RO1,,2130,1990,,,,,512,512,95,0.977,0.977,3
LUNG1-035,L,109.45,17.58,17.55,3.75,,,3,1,Rad4,Rad3,RO1,140.3,52.82,0.961482995,0.837406226,0.864652606,,0.960609521,RO1,,2220,1770,,,,,512,512,94,0.977,0.977,3
LUNG1-036,L,37.82,,,,,,1,0,,,,,,,,,,0.995500291,RO1,,2830,2090,,,,,512,512,135,0.976563,0.976563,3
LUNG1-037,R,6.15,9.71,,,,,1,0,,,,,,,,,,0.980498283,RO1,,2110,1580,,,,,512,512,109,0.977,0.977,3
LUNG1-038,L,117.03,13,,,,,3,1,Rad4,Rad3,RO1,,,0.726588049,0.761125142,0.736359468,,0.622209417,RO1,,1700,1320,,,,,512,512,176,0.977,0.977,3
LUNG1-039,L,5.73,,,,,,2,0,,,,,,,,,,0.997584664,RO1,,2460,2040,,,,,512,512,95,0.977,0.977,3
LUNG1-040,R,257.54,8.4,,,,,3,0,,,,,,,,,,0.93556402,RO1,RO3,1350,1250,0.990143724,,,,512,512,95,0.977,0.977,3
LUNG1-041,R,47.27,,,,,,3,0,,,,,,,,,,0.955537137,RO1,RO3,1530,1400,0.988736982,,,,512,512,104,0.977,0.977,3
LUNG1-042,R,167.9,,,,,,3,1,Rad4,Rad3,RO1,30.31,,0.591466652,0.443210829,0.782480986,,0.950974869,RO1,,1450,1810,,,,,512,512,99,0.977,0.977,3
LUNG1-043,L,226.29,1.64,3.76,1.42,,,3,0,,,,,,,,,,0.939221566,RO1,,2580,1790,,,,,512,512,103,0.977,0.977,3
LUNG1-044,L,119.01,7.62,,,,,3,0,,,,,,,,,,0.980896622,RO1,,1480,1740,,,,,512,512,99,0.977,0.977,3
LUNG1-045,L,19.82,,,,,,2,0,,,,,,,,,,0.943377328,RO1,,1920,1280,,,,,512,512,108,0.977,0.977,3
LUNG1-046,L,121.11,,,,,,3,1,Rad4,Rad3,RO1,17.4,8.51,0.764178094,0.520243424,0.670105248,,0.895341133,RO1,,1870,1620,,,,,512,512,89,0.977,0.977,3
LUNG1-047,R,48.09,20.31,,,,,3,0,,,,,,,,,,0.99212666,RO1,RO3,2240,2030,0.993123294,,,,512,512,110,0.977,0.977,3
LUNG1-048,R,48.11,,,,,,3,0,,,,,,,,,,0.928707208,RO1,,1280,1140,,,,,512,512,135,0.976563,0.976563,3
LUNG1-049,R,1.66,,,,,,2,0,,,,,,,,,,0.980771483,RO1,,2950,2510,,,,,512,512,118,0.977,0.977,3
LUNG1-050,L,5.16,,,,,,2,1,Rad4,Rad3,,53.52,,,0.772927205,,,0.954259057,RO1,RO3,1430,1330,0.985629389,,,,512,512,104,0.977,0.977,3
LUNG1-051,R,83.32,,,,,,2,1,Rad4,Rad3,RO1,14.16,,,0.921965318,,,0.972556351,RO1,RO3,3140,2930,0.99524637,,,,512,512,125,0.976563,0.976563,3
LUNG1-052,R,111.38,47.87,,,,,3,0,,,,,,,,,,0.954263088,RO1,,1470,1160,,,,,512,512,127,0.977,0.977,3
LUNG1-053,R,79.81,,,,,,3,1,Rad4,Rad3,,760.7,50.39,0.949853778,0.929592211,0.908195795,,0.922530476,RO1,,3250,1350,,,,,512,512,94,0.977,0.977,3
LUNG1-054,R,57.68,12.44,,,,,1,0,,,,,,,,,,0.990817969,RO1,,2430,2860,,,,,512,512,117,0.977,0.977,3
LUNG1-055,R,43.48,150.17,2.74,,,,3,0,,,,,,,,,,0.993526538,RO1,RO3,1680,1580,0.992995833,,,,512,512,125,0.977,0.977,3
LUNG1-056,L,119.76,2.56,,,,,1,0,,,,,,,,,,0.949290601,RO1,,2310,1380,,,,,512,512,134,0.976563,0.976563,3
LUNG1-057,L,69.88,51.74,,,,,3,0,,,,,,,,,,0.963331125,RO1,RO3,2080,1710,0.983187958,,,,512,512,101,0.977,0.977,3
LUNG1-058,,,,,,,,,,,,,,,,,,,,,,,,,,,,,,,,,
LUNG1-059,R,35.24,5.29,,,,,1,0,,,,,,,,,14.13,0.959478123,RO1,RO3,2570,2720,0.99869165,,,,512,512,110,0.977,0.977,3
LUNG1-060,L,189.06,2.03,,,,,3,1,Rad4,Rad3,,73.85,520.8,,0.963110231,,,0.924479672,RO1,,3170,2750,,,,,512,512,134,0.977,0.977,3
LUNG1-061,,,,,,,,,,,,,,,,,,,,,,,,,,,,,,,,,
LUNG1-062,L,3.2,12.97,,,,,2,0,,,,,,,,,,0.977172225,RO1,,1760,1410,,,,,512,512,101,0.977,0.977,3
LUNG1-063,L,10.95,,,,,,1,0,,,,,,,,,,0.962259801,RO1,,1400,938,,,,,512,512,114,0.977,0.977,3
LUNG1-064,R,15.52,3.52,,,,,3,0,,,,,,,,,,0.985487918,RO1,,3000,2380,,,,,512,512,104,0.977,0.977,3
LUNG1-065,L,263.04,34.22,45.58,,,,3,1,Rad4,Rad3,RO1,,82,0.833853613,0.813625501,0.816787596,,0.851903757,RO1,RO3,1710,1610,0.982707626,,,,512,512,135,0.976563,0.976563,3
LUNG1-066,R,17.65,2,4.34,,,,1,0,,,,,,,,,,0.971460266,RO1,,1870,1130,,,,,512,512,92,0.977,0.977,3
LUNG1-067,R,26.74,,,,,,3,0,,,,,,,,,,0.946111434,RO1,RO3,2250,2070,0.998154755,,,,512,512,176,0.976563,0.976563,3
LUNG1-068,R,72.73,113.94,,,,,3,1,Rad4,Rad3,,33.57,,,0.913166626,,,0.977211057,RO1,,2540,2210,,,,,512,512,105,0.977,0.977,3
LUNG1-069,,,,,,,,,,,,,,,,,,,,,,,,,,,,,,,,,
LUNG1-070,L,23.21,,,,,,3,0,,,,,,,,,,0.987091484,RO1,,3110,2160,,,,,512,512,109,0.977,0.977,3
LUNG1-071,R,31.74,5.03,,,,,1,0,,,,,,,,,,0.866937917,RO1,,1470,1470,,,,,512,512,135,0.976563,0.976563,3
LUNG1-072,L,79.54,9.33,,,,,1,0,,,,,,,,,,0.980062673,RO1,RO3,2070,1850,0.997564061,,,,512,512,127,0.976563,0.976563,3
LUNG1-073,R,81.81,10.48,,,,,3,0,,,,,,,,,,0.974579833,RO1,,2070,1660,,,,,512,512,176,0.976563,0.976563,3
LUNG1-074,,,,,,,,,,,,,,,,,,,,,,,,,,,,,,,,,
LUNG1-075,R,77.66,5.25,,,,,1,0,,,,,,,,,,0.779087803,RO1,,2450,1880,,,,,512,512,176,0.976563,0.976563,3
LUNG1-076,R,3.4,1.02,,,,,1,0,,,,,,,,,,0.965389355,RO1,,2050,1490,,,,,512,512,92,0.977,0.977,3
LUNG1-077,L,50.65,,,,,,3,0,,,,,,,,,,0.910628999,RO1,,1580,1050,,,,,512,512,117,0.976563,0.976563,3
LUNG1-078,R,9.67,,,,,,2,0,,,,,,,,,,0.983651552,RO1,,3070,2660,,,,,512,512,136,0.977,0.977,3
LUNG1-079,R,41.66,8.43,,,,,1,0,,,,,,,,,,0.886584386,RO1,,939,1790,,,,,512,512,135,0.976563,0.976563,3
LUNG1-080,R,3.97,,,,,,2,0,,,,,,,,,,0.949316913,RO1,,2370,2570,,,,,512,512,99,0.976563,0.976563,3
LUNG1-081,R,6.1,256.76,,,,,2,0,,,,,,,,,,0.980861334,RO1,,2510,1920,,,,,512,512,113,0.977,0.977,3
LUNG1-082,R,4.98,39.1,,,,,1,0,,,,,,,,,,0.957937739,RO1,,1810,1660,,,,,512,512,176,0.976563,0.976563,3
LUNG1-083,L,10.44,,,,,,2,0,,,,,,,,,,0.990322075,Rad2,,3190,3110,,,,,512,512,113,0.976563,0.976563,3
LUNG1-084,L,8.58,0.74,,,,,1,0,,,,,,,,,24.92,0.942899898,RO1,,2600,2080,,,,,512,512,135,0.976563,0.976563,3
LUNG1-085,,,,,,,,,,,,,,,,,,,,,,,,,,,,,,,,,
LUNG1-086,R,0.57,96.91,,,,,2,0,,,,,,,,,17.28,0.934850848,RO1,,2240,1690,,,,,512,512,176,0.976563,0.976563,3
LUNG1-087,L,3.35,,,,,,2,0,,,,,,,,,7.22,0.993701476,RO1,RO3,2790,2550,0.999142371,,,,512,512,116,0.977,0.977,3
LUNG1-088,R,18.73,400.01,,,,,3,1,Rad4,Rad3,,148.4,,,0.901653124,,26.62,0.926914341,RO1,RO3,3080,3180,0.962421702,,,,512,512,123,0.977,0.977,3
LUNG1-089,L,0.78,30.92,0.22,,,,2,0,,,,,,,,,12.97,0.965274235,RO1,RO3,1950,1570,0.999103618,,,,512,512,94,0.977,0.977,3
LUNG1-090,R,5.21,,,,,,1,0,,,,,,,,,9.88,0.99313,RO1,,3160,3050,,,,,512,512,125,0.976563,0.976563,3
LUNG1-091,L,407.37,5.3,14.34,,,,3,1,Rad4,Rad3,RO1,,955.8,0.871981051,0.99395341,0.866440772,19.28,0.77227781,RO1,,2330,2160,,,,,512,512,135,0.977,0.977,3
LUNG1-092,R,65.99,3.19,,,,,1,0,,,,,,,,,14.02,0.973819726,RO1,RO3,2480,2590,0.992660831,,,,512,512,135,0.976563,0.976563,3
LUNG1-093,R,50.68,17.87,1.13,,,,1,1,Rad4,Rad3,,27.97,,,0.564266067,,16.92,0.847079352,RO1,,2590,2430,,,,,512,512,176,0.976563,0.976563,3
LUNG1-094,R,3,1.51,,,,,2,0,,,,,,,,,13.43,0.880358925,RO1,,1620,1110,,,,,512,512,84,0.976563,0.976563,3
LUNG1-095,R,296.45,,,,,,3,1,Rad3,Rad4,,97.2,,,0.829693721,,16.85,0.660055359,Rad2,,1460,2220,,,,,512,512,107,0.977,0.977,3
LUNG1-096,R,106.18,5.5,,,,,3,0,,,,,,,,,13.37,0.90573663,RO1,,2900,2640,,,,,512,512,176,0.976563,0.976563,3
LUNG1-097,L,337.5,,,,,,3,1,Rad4,Rad3,RO1,777.4,,0.798162813,0.946064219,0.795782246,42.05,0.859728362,RO1,,2610,2520,,,,,512,512,135,0.976563,0.976563,3
LUNG1-098,R,1.08,52.23,,,,,2,0,,,,,,,,,15.05,0.956667079,RO1,,2340,2100,,,,,512,512,110,0.976563,0.976563,3
LUNG1-099,L,57.69,,,,,,3,0,,,,,,,,,13.17,0.976516219,RO1,,3070,2780,,,,,512,512,117,0.976563,0.976563,3
LUNG1-100,L,2.54,,,,,,2,0,,,,,,,,,8.17,0.98106922,RO1,,1620,1380,,,,,512,512,107,0.976563,0.976563,3
LUNG1-101,R,47.02,25.61,,,,,1,0,,,,,,,,,11.2,0.983643539,RO1,,1800,1600,,,,,512,512,112,0.977,0.977,3
LUNG1-102,R,9.92,,,,,,2,0,,,,,,,,,12.97,0.982887283,RO1,,2200,2190,,,,,512,512,118,0.976563,0.976563,3
LUNG1-103,L,9.09,,,,,,2,0,,,,,,,,,18.47,0.971423573,RO1,,2400,2610,,,,,512,512,112,0.976563,0.976563,3
LUNG1-104,L,108.85,4.96,,,,,2,1,Rad4,Rad3,,,9.28,,0.595730106,,27.75,0.353530973,RO1,,1800,1300,,,,,512,512,297,0.976563,0.976563,3
LUNG1-105,L,302.33,,,,,,2,0,,,,,,,,,16.95,0.939512422,RO1,,2350,2130,,,,,512,512,112,0.976563,0.976563,3
LUNG1-106,R,4.76,89.27,25.96,84.97,,,1,0,,,,,,,,,9.933333333,0.978995664,RO2,,1830,1640,,,,,512,512,99,0.976563,0.976563,3
LUNG1-107,R,10.01,,,,,,1,1,Rad4,Rad3,,40.25,,,0.929641431,,20.87,0.959647704,RO2,,2510,1420,,,,,512,512,116,0.977,0.977,3
LUNG1-108,R,0.87,13.03,,,,,3,0,,,,,,,,,21.15,0.970524727,RO2,Rad2,2630,2050,,,,1,512,512,176,0.976563,0.976563,3
LUNG1-109,R,87.12,18.71,,,,,2,0,,,,,,,,,9.733333333,0.980814147,RO2,,2010,1800,,,,,512,512,97,0.976563,0.976563,3
LUNG1-110,R,0.82,1.04,,,,,2,0,,,,,,,,,32.83333333,0.954448001,RO2,,2130,1730,,,,,512,512,176,0.976563,0.976563,3
LUNG1-111,R,2.07,,,,,,2,0,,,,,,,,,14,0.792370909,RO2,,2910,2630,,,,,512,512,216,0.976563,0.976563,3
LUNG1-112,L,7.63,,,,,,1,0,,,,,,,,,18.73333333,0.947646057,RO2,,3280,1980,,,,,512,512,176,0.976563,0.976563,3
LUNG1-113,R,45.65,32.47,,,,,3,1,Rad4,Rad3,,9.43,,,0.864180636,,12.23333333,0.962678382,RO2,,2160,2020,,,,,512,512,118,0.976563,0.976563,3
LUNG1-114,L,2.14,4.15,,,,,2,0,,,,,,,,,,0.956929093,RO2,,2320,1850,,,,,512,512,129,0.976563,0.976563,3
LUNG1-115,R,224.92,68.05,,,,,3,1,Rad4,Rad3,,65.06,,,0.752451457,,13.66666667,0.946049797,RO2,,2570,2330,,,,,512,512,106,0.976563,0.976563,3
LUNG1-116,L,176.96,,,,,,3,0,,,,,,,,,24.63,0.959343742,RO2,Rad2,3250,1820,,,,0.999392253,512,512,142,0.976563,0.976563,3
LUNG1-117,R,5.48,,,,,,2,1,Rad4,Rad3,,17.38,10.91,,0.94192023,,19.53,0.948422398,RO2,,2150,1690,,,,,512,512,90,0.977,0.977,3
LUNG1-118,L,5.22,,,,,,2,0,,,,,,,,,15.73333333,0.981802185,RO2,,3020,3000,,,,,512,512,124,0.976563,0.976563,3
LUNG1-119,R,1.94,32.76,,,,,2,0,,,,,,,,,18.22,0.958796806,RO2,,1990,1690,,,,,512,512,116,0.976563,0.976563,3
LUNG1-120,R,34.64,,,,,,1,0,,,,,,,,,15,0.980455926,RO2,,2360,2310,,,,,512,512,114,0.976563,0.976563,3
LUNG1-121,R,28.9,6.25,,,,,3,0,,,,,,,,,13,0.968638653,RO2,,2580,2570,,,,,512,512,125,0.976563,0.976563,3
LUNG1-122,L,10.92,,,,,,1,0,,,,,,,,,9.3,0.984046613,RO2,,2350,1960,,,,,512,512,124,0.976563,0.976563,3
LUNG1-123,R,71.51,1.78,,,,,1,0,,,,,,,,,18.83,0.975327409,RO2,Rad2,3070,1780,,,,1,512,512,114,0.976563,0.976563,3
LUNG1-124,L,28.63,14.83,18.8,3.5,,,1,0,,,,,,,,,19.83,0.945818786,RO2,,2570,2530,,,,,512,512,111,0.976563,0.976563,3
LUNG1-125,R,41.59,98.32,,,,,3,0,,,,,,,,,15.83,0.978312744,RO2,Rad2,2210,1830,,,,0.999159465,512,512,107,0.977,0.977,3
LUNG1-126,L,3.98,40.43,,,,,2,0,,,,,,,,,17.2,0.940538898,RO2,,1600,1170,,,,,512,512,123,0.976563,0.976563,3
LUNG1-127,L,10.62,12.73,1.98,29.29,0.75,48.32,3,0,,,,,,,,,16.97,0.969446661,RO2,Rad2,2200,1600,,,,0.998980658,512,512,116,0.976563,0.976563,3
LUNG1-128,L,148.27,,,,,,3,1,Rad4,Rad3,,,352.2,,0.886458503,,9.333333333,0.880298934,RO2,,1770,1380,,,,,512,512,100,0.976563,0.976563,3
LUNG1-129,R,21.93,0.92,,,,,1,0,,,,,,,,,15.65,0.945554534,RO2,,1650,1560,,,,,512,512,112,0.976563,0.976563,3
LUNG1-130,R,148.32,296.3,,,,,1,0,,,,,,,,,17.92,0.952938891,RO2,,1790,1510,,,,,512,512,104,0.976563,0.976563,3
LUNG1-131,L,12.68,,,,,,1,0,,,,,,,,,7.783333333,0.985072232,RO2,Rad2,2100,1580,,,,0.981833071,512,512,114,0.976563,0.976563,3
LUNG1-132,R,42.88,0.27,,,,,1,0,,,,,,,,,18.07,0.955027586,RO2,,1820,1740,,,,,512,512,114,0.976563,0.976563,3
LUNG1-133,L,1.45,,,,,,2,1,Rad4,Rad3,,47.31,50.5,,0.842130045,,19.08333333,0.743495753,RO2,,3410,2550,,,,,512,512,184,0.976563,0.976563,3
LUNG1-134,R,1.73,,,,,,2,0,,,,,,,,,12.55,0.988680171,RO2,Rad2,2890,2660,,,,0.985887599,512,512,108,0.976563,0.976563,3
LUNG1-135,L,4.98,59.82,,,,,1,0,,,,,,,,,20.37,0.967598139,RO2,Rad2,2050,1580,,,,0.990883461,512,512,93,0.976563,0.976563,3
LUNG1-136,R,13.31,,,,,,2,0,,,,,,,,,15.35,0.909869069,RO2,Rad2,2050,1930,,,,1,512,512,110,0.976563,0.976563,3
LUNG1-137,,,,,,,,,,,,,,,,,,,,,,,,,,,,,,,,,
LUNG1-138,L,2.98,1.62,,,,,2,0,,,,,,,,,16.5,0.891812318,RO2,Rad2,364,1990,,,,0.999970839,512,512,93,0.976563,0.976563,3
LUNG1-139,L,5.68,,,,,,3,0,,,,,,,,,17.5,0.98018176,RO2,,1970,2390,,,,,512,512,107,0.976563,0.976563,3
LUNG1-140,R,327.5,,,,,,3,0,,,,,,,,,25.33,0.9217754,RO2,,2000,1970,,,,,512,512,111,0.977,0.977,3
LUNG1-141,R,168.88,,,,,,3,0,,,,,,,,,18.78333333,0.937282276,RO2,Rad2,2020,1720,,,,0.990876728,512,512,118,0.976563,0.976563,3
LUNG1-142,R,211.3,23.75,,,,,3,0,,,,,,,,,11.36666667,0.977147415,RO2,,2230,1980,,,,,512,512,103,0.976563,0.976563,3
LUNG1-143,R,90.58,22.62,,,,,3,1,Rad4,Rad3,,43.63,12.23,,0.98395861,,27.5,0.940189812,RO2,,1560,1590,,,,,512,512,134,0.976563,0.976563,3
LUNG1-144,L,246.33,,,,,,3,0,,,,,,,,,22.95,0.9254713,RO2,,2200,1900,,,,,512,512,134,0.976563,0.976563,3
LUNG1-145,R,34.04,,,,,,3,0,,,,,,,,,15.5,0.974757272,RO2,,1840,1830,,,,,512,512,111,0.976563,0.976563,3
LUNG1-146,L,7.28,18.4,,,,,3,0,,,,,,,,,12.33333333,0.90687742,RO2,,2270,1560,,,,,512,512,134,0.976563,0.976563,3
LUNG1-147,L,38.36,36.07,,,,,1,0,,,,,,,,,11.7,0.978217624,RO2,,1980,1400,,,,,512,512,99,0.976563,0.976563,3
LUNG1-148,L,109.6,19.14,,,,,3,1,Rad4,Rad3,,89.7,17.16,,0.966597972,,14,0.93775523,RO2,Rad2,2050,1690,,,,1,512,512,108,0.976563,0.976563,3
LUNG1-149,L,397.85,,,,,,3,1,Rad4,Rad3,,,111,,0.987812224,,28.37,0.836023161,RO2,,1900,1320,,,,,512,512,118,0.7207,0.7207,3
LUNG1-150,L,7.35,0.16,,,,,2,0,,,,,,,,,17.28,0.973620944,RO2,Rad2,2120,1860,,,,1,512,512,120,0.976563,0.976563,3
LUNG1-151,R,36.92,6.68,,,,,2,0,,,,,,,,,24.2,0.954330592,RO2,Rad2,3590,2910,,,,1,512,512,118,0.976563,0.976563,3
LUNG1-152,R,5.01,,,,,,2,0,,,,,,,,,23.5,0.929315098,RO2,,3110,2360,,,,,512,512,119,0.976563,0.976563,3
LUNG1-153,R,5.06,,,,,,2,0,,,,,,,,,28.65,0.716699779,RO2,,1740,1510,,,,,512,512,106,0.976563,0.976563,3
LUNG1-154,L,4.64,,,,,,2,0,,,,,,,,,24.25,0.930098447,RO2,,2340,2050,,,,,512,512,113,0.977,0.977,3
LUNG1-155,R,57.96,6.51,6.35,1.62,2.47,2.04,3,0,,,,,,,,,11.97,0.929878546,RO2,,2050,1710,,,,,512,512,121,0.977,0.977,3
LUNG1-156,R,0.43,39.76,7.09,26.05,,,2,1,Rad4,Rad3,,678.4,270.4,,0.989475288,,16,0.850910335,RO2,,2370,1770,,,,,512,512,101,0.976563,0.976563,3
LUNG1-157,L,14.13,,,,,,2,0,,,,,,,,,9.08,0.977560417,RO2,Rad2,2060,1840,,,,0.967036963,512,512,100,0.976563,0.976563,3
LUNG1-158,R,0.84,92.31,,,,,2,0,,,,,,,,,18.33333,0.846528962,RO2,,1250,1460,,,,,512,512,115,0.977,0.977,3
LUNG1-159,R,53.36,,,,,,3,0,,,,,,,,,21.75,0.961715478,RO2,,2540,2490,,,,,512,512,105,0.977,0.977,3
LUNG1-160,R,4.62,,,,,,2,0,,,,,,,,,21,0.95768093,RO2,,3590,2790,,,,,512,512,144,0.976563,0.976563,3
LUNG1-161,R,0.45,,,,,,2,0,,,,,,,,,14.62,0.957697061,RO2,,2670,1930,,,,,512,512,124,0.976563,0.976563,3
LUNG1-162,L,14.26,20.45,,,,,1,0,,,,,,,,,18.53,0.970416813,RO2,,2190,2200,,,,,512,512,124,0.976563,0.976563,3
LUNG1-163,R,131.34,,,,,,3,0,,,,,,,,,17.283333,0.928169816,RO2,,1440,1610,,,,,512,512,108,0.976563,0.976563,3
LUNG1-164,R,24.17,1.47,9,2.86,4.45,,2,0,,,,,,,,,15.22,0.954066188,RO2,,1520,1340,,,,,512,512,134,0.976563,0.976563,3
LUNG1-165,R,7.66,10.89,,,,,2,0,,,,,,,,,19.5,0.967163139,RO2,Rad2,2040,1840,,,,1,512,512,103,0.976563,0.976563,3
LUNG1-166,L,22.19,,,,,,3,0,,,,,,,,,9.383333333,0.990157595,RO2,,2580,2210,,,,,512,512,134,0.976563,0.976563,3
LUNG1-167,L,0.38,50.13,,,,,2,0,,,,,,,,,23.62,0.931879415,RO2,,2680,2790,,,,,512,512,134,0.976563,0.976563,3
LUNG1-168,R,57.63,,,,,,3,1,Rad4,Rad3,,3.2,46.06,,0.994010576,,15.83,0.965048622,RO2,Rad2,2110,1560,,,,0.992895608,512,512,134,0.976563,0.976563,3
LUNG1-169,R,17.03,30.06,,,,,3,0,,,,,,,,,20.82,0.971992927,RO2,,2360,2280,,,,,512,512,97,0.976563,0.976563,3
LUNG1-170,L,36.75,,,,,,2,1,Rad4,Rad3,,87.83,61.74,,0.922485981,,11.93,0.980655109,RO2,Rad2,2410,2700,,,,1,512,512,110,0.977,0.977,3
LUNG1-171,R,13.21,,,,,,2,0,,,,,,,,,14.2,0.981323209,RO2,,2610,1870,,,,,512,512,112,0.976563,0.976563,3
LUNG1-172,R,159.34,7.96,,,,,3,0,,,,,,,,,20.45,0.964317343,RO2,,2630,2460,,,,,512,512,95,0.912109,0.912109,3
LUNG1-173,L,199.9,,,,,,3,0,,,,,,,,,13.55,0.944966537,RO2,,2130,1780,,,,,512,512,106,0.977,0.977,3
LUNG1-174,R,5.38,,,,,,2,0,,,,,,,,,11.48,0.983502888,RO2,,2730,571,,,,,512,512,108,0.976563,0.976563,3
LUNG1-175,L,32.05,,,,,,3,0,,,,,,,,,16,0.982017324,RO2,,2620,2210,,,,,512,512,112,0.976563,0.976563,3
LUNG1-176,R,,,,,,,2,0,,,,,,,,,12.16,0.95525488,RO2,Rad2,1600,1210,,,,1,512,512,106,0.976563,0.976563,3
LUNG1-177,R,38.36,3.39,1.23,,,,3,1,Rad4,Rad3,,103.1,,,0.979149244,,17.28,0.953361913,RO2,,1710,1720,,,,,512,512,94,0.977,0.977,3
LUNG1-178,L,1.81,,,,,,1,0,,,,,,,,,18,0.957566028,RO2,Rad2,2070,1920,,,,0.99995986,512,512,126,0.976563,0.976563,3
LUNG1-179,L,356.16,2.35,,,,,3,0,,,,,,,,,21.78,0.908562596,RO2,,2850,1930,,,,,512,512,123,0.976563,0.976563,3
LUNG1-180,,,,,,,,,,,,,,,,,,,,,,,,,,,,,,,,,
LUNG1-181,L,142.4,4.18,,,,,3,0,,,,,,,,,16.47,0.960323907,RO2,,2850,2230,,,,,512,512,142,0.976563,0.976563,3
LUNG1-182,R,7.24,17.53,,,,,1,0,,,,,,,,,14.45,0.956430635,RO2,,2190,1880,,,,,512,512,134,0.977,0.977,3
LUNG1-183,R,7.4,4.37,1.3,15.22,12.55,,2,0,,,,,,,,,15.55,0.959118794,RO2,Rad2,1830,1730,,,,1,512,512,109,0.976563,0.976563,3
LUNG1-184,R,27.08,,,,,,2,0,,,,,,,,,20.17,0.974985744,RO2,,3190,3000,,,,,512,512,134,0.977,0.977,3
LUNG1-185,R,36.3,2.54,,,,,1,0,,,,,,,,,9.9,0.976493762,RO2,,2120,2090,,,,,512,512,134,0.977,0.977,3
LUNG1-186,L,157.75,,,,,,3,1,Rad4,Rad3,,,28.41,,0.938980694,,15.9,0.932326912,RO2,,2310,1350,,,,,512,512,134,0.977,0.977,3
LUNG1-187,R,15.51,,,,,,1,0,,,,,,,,,18.32,0.910224888,RO2,Rad2,1380,1190,,,,1,512,512,94,0.977,0.977,3
LUNG1-188,L,2.3,33.66,,,,,2,0,,,,,,,,,14.02,0.974509559,Rad2,,2300,1920,,,,,512,512,115,0.977,0.977,3
LUNG1-189,R,47.08,1,0.46,2.52,2.67,5.48,1,0,,,,,,,,,11.6,0.967217171,Rad2,,1920,1540,,,,,512,512,94,0.976563,0.976563,3
LUNG1-190,L,202.83,,,,,,3,0,,,,,,,,,14.75,0.939098768,Rad2,,1890,1650,,,,,512,512,112,0.977,0.977,3
LUNG1-191,L,99.54,10.03,,,,,3,0,,,,,,,,,17.25,0.980020865,Rad2,,3060,2830,,,,,512,512,119,0.976563,0.976563,3
LUNG1-192,R,0.57,90.39,,,,,2,0,,,,,,,,,17.55,0.890692859,Rad2,,1630,1600,,,,,512,512,134,0.976563,0.976563,3
LUNG1-193,R,144.61,11.12,,,,,3,0,,,,,,,,,18.5,0.942982167,Rad2,,1600,1430,,,,,512,512,106,0.976563,0.976563,3
LUNG1-194,,,,,,,,,,,,,,,,,,,,,,,,,,,,,,,,,
LUNG1-195,R,1.54,1.21,,,,,2,1,Rad4,Rad3,,22.4,4.92,,0.763212435,,13.28,0.966491841,Rad2,,1700,1170,,,,,512,512,90,0.976563,0.976563,3
LUNG1-196,R,275.77,,,,,,3,1,Rad4,Rad3,,30.59,,,0.905348048,,11.05,0.867302404,Rad2,,1270,1050,,,,,512,512,94,0.976563,0.976563,3
LUNG1-197,L,43.23,,,,,,1,0,,,,,,,,,19.95,0.820202314,Rad2,,2260,1860,,,,,512,512,143,0.976563,0.976563,3
LUNG1-198,,,,,,,,,,,,,,,,,,,,,,,,,,,,,,,,,
LUNG1-199,L,124.63,7.78,,,,,3,0,,,,,,,,,18.06,0.955561306,Rad2,,1450,1160,,,,,512,512,109,0.976563,0.976563,3
LUNG1-200,R,92.22,,,,,,3,0,,,,,,,,,16.48333,0.922374504,Rad2,,1420,3490,,,,,512,512,134,0.976563,0.976563,3
LUNG1-201,,,,,,,,,,,,,,,,,,,,,,,,,,,,,,,,,
LUNG1-202,L,8.19,4.59,,,,,1,0,,,,,,,,,19.58,0.94303713,Rad2,,1480,1120,,,,,512,512,134,0.976563,0.976563,3
LUNG1-203,,,,,,,,,,,,,,,,,,,,,,,,,,,,,,,,,
LUNG1-204,,,,,,,,,,,,,,,,,,,,,,,,,,,,,,,,,
LUNG1-205,L,58.63,3.29,,,,,1,1,Rad4,Rad3,,21.97,21.52,,0.98493889,,14.4,0.928347839,Rad2,,2130,1230,,,,,512,512,94,0.976563,0.976563,3
LUNG1-206,L,7.03,,,,,,2,0,,,,,,,,,17.75,0.974715552,Rad2,,2290,2120,,,,,512,512,134,0.976563,0.976563,3
LUNG1-207,,,,,,,,,,,,,,,,,,,,,,,,,,,,,,,,,
LUNG1-208,R,41.1,47.06,,,,,2,0,,,,,,,,,25.06,0.968294659,Rad1,,2730,2260,,,,,512,512,116,0.976563,0.976563,3
LUNG1-209,,,,,,,,,,,,,,,,,,,,,,,,,,,,,,,,,
LUNG1-210,L,54.22,,,,,,1,0,,,,,,,,,26,0.957720886,Rad1,,3110,2260,,,,,512,512,131,0.976563,0.976563,3
LUNG1-211,L,46.8,1.18,0.99,3.07,4.21,7.21,3,0,,,,,,,,,14.07,0.971525102,Rad1,Rad2,2170,1820,,,0.998052355,,512,512,94,0.976563,0.976563,3
LUNG1-212,R,7.11,,,,,,1,0,,,,,,,,,13.98,0.958914064,Rad1,,1460,2290,,,,,512,512,111,0.976563,0.976563,3
LUNG1-213,L,14.1,,,,,,1,0,,,,,,,,,15.63,0.979071521,Rad1,Rad2,2100,1720,,,0.998428296,,512,512,94,0.976563,0.976563,3
LUNG1-214,R,57.84,,,,,,1,0,,,,,,,,,17.06,0.971004236,Rad1,Rad2,2450,1770,,,0.998674305,,512,512,105,0.976563,0.976563,3
LUNG1-215,R,1.63,35.36,1.74,,,,2,0,,,,,,,,,19.03,0.841001511,Rad1,,1420,1790,,,,,512,512,75,0.976563,0.976563,3
LUNG1-216,R,3.91,33.9,,,,,1,0,,,,,,,,,16.45,0.890162089,Rad1,,2740,2300,,,,,512,512,134,0.976563,0.976563,3