Patient,Included_Upenn,Included_CWRU,Age,gender,Histopathology,location,EoR,Surgery,survival_days,Molecular_subtype,IDH1,1p19q_deletion,MGMT PCR,MGMT,EGFR vIII,EGFR,PTEN,KPS(initial),Time To Progression (in days),Time To Last Follow-up (in days),Cause Of Death,4_Modalities
W1,Yes,Yes,66,Male,GBM; Gr.IV; GBM; Gr.IV,Right Frontal,Complete,primary,105,Classical,wildtype,Negative,unmethylated,40%,not detected,amplification,deletion,100,95,NA,Deceased due to tumor progression,Yes
W10,Yes,Yes,44,Female,GBM; Gr.IV,Left Parietal,Complete,primary,,Proneural,R132H,Positive,methylated,negative,not detected,gain,gain,100,NA,1801,NA,Yes
W11,Yes,Yes,57,Male,GBM; Gr.IV,Right Parietal,Complete,primary,1076,Classical; Mesenchymal,wildtype,Negative,methylated,50%,not detected,gain,loss,100,159,NA,Deceased due to tumor progression,Yes
W12,Yes,Yes,61,Female,GBM; with small cell features; Gr.IV,Right Temporal,Sub-total,primary,80,Classical,wildtype,Negative,unmethylated,20%,not detected,amplification,loss,70,NA,NA,Deceased due to tumor progression,Yes
W13,Yes,Yes,59,Female,GBM,Right Parietal,Complete,primary,250,Mesenchymal,wildtype,Negative,unmethylated,50%,detected,amplification,loss,90,235,NA,Deceased due to tumor progression,Yes
W18,Yes,Yes,36,Female,GBM; giant cell type; Gr.IV,Right Parietal,Sub-total,primary,903,,wildtype,Negative,methylated,25%,not detected,gain,gain,90,489,NA,Deceased due to tumor progression,Yes
W19,Yes,Yes,67,Female,GBM; Gr.IV,Left Temporal,Complete,primary,615,Proneural,wildtype,Negative,unmethylated,30%,not detected,gain,negative,80,NA,NA,Deceased due to tumor progression,Yes
W2,Yes,Yes,64,Female,GBM; Gr.IV,Right Frontal,Complete,primary,1096,Classical; Neural,wildtype,Positive,methylated,negative,not detected,amplification,loss,90,908,NA,Deceased due to tumor progression,Yes
W20,Yes,Yes,43,Male,recurrent GBM,Right Parietal; Right Temporal,Complete,recurrent,363,Mesenchymal,wildtype,Negative,unmethylated,80%,not detected,gain,gain,90,103,NA,Deceased due to tumor progression,Yes
W22,Yes,Yes,52,Female,Edematous glioma; Anaplastic astro.; Gr.III / IV,Left Temporal,Complete,primary; recurrent,,Classical; Neural; Neural,wildtype,Negative,methylated,20%,detected,amplification,loss,90,753,1634,NA,Yes
W29,Yes,Yes,73,Male,GBM,Right Parietal,Complete,primary,260,Classical; Neural,wildtype,Negative,unmethylated,10%-15%,detected,amplification,deletion,100,246,NA,Deceased due to tumor progression,Yes
W30,Yes,No,59,Male,GBM; Gr.IV,Left Parietal,Sub-total,primary,759,,wildtype,Negative,methylated ,15%,not detected,amplification,deletion,70,NA,NA,Deceased due to tumor progression,Yes
W32,Yes,Yes,56,Male,GBM; Gr.IV,Right Frontal,Complete,primary,,Proneural,wildtype,Negative,methylated,negative,not detected,gain,gain,90,NA,1484,NA,Yes
W33,Yes,Yes,60,Male,GBM; Gr.IV,Right Parietal,Complete,primary,,Classical,wildtype,Negative,methylated,25%,not detected,amplification,loss,80,NA,1434,NA,Yes
W34,Yes,Yes,73,Male,GBM; Gr.IV,Left Temporal,Complete,primary,351,Classical; Mesenchymal,wildtype,Negative,unmethylated,50%,not detected,gain,deletion,90,170,NA,Deceased due to tumor progression,Yes
W35,Yes,Yes,36,Female,Anaplastic astrocytoma Gr.III/IV ,Right Parietal,Complete,primary,,,R132H,Negative,methylated,0%,not detected,gain,gain,100,NA,1420,NA,Yes
W36,Yes,Yes,61,Male,GBM; Gr.IV,Left Parietal,Sub-total,primary,544,Mesenchymal,wildtype,Negative,unmethylated,70%,not detected,gain,gain,80,241,NA,Deceased due to tumor progression,Yes
W38,Yes,Yes,64,Female,GBM; Gr.IV/IV,Right Temporal,Sub-total,primary,311,Proneural,wildtype,Negative,methylated,negative,not detected,gain,Normal,70,236,NA,Deceased due to tumor progression,Yes
W26,Yes,Yes,57,Female,GBM,Right Parietal; Right Temporal,Complete,primary (non-baseline),1293,Neural,wildtype,NA,NA,NA,NA,NA,NA,100,1005,NA,Deceased due to tumor progression,Yes
W39,Yes,Yes,67,Female,GBM,Right Frontal,Sub-total,primary,880,Classical,wildtype,Negative,methylated,25%,NA,amplification,loss,60,97,NA,Deceased due to tumor progression,Yes
W4,Yes,Yes,50,Female,GBM Gr.IV; GBM Gr.IV ,Right Frontal,Complete,primary,540,Mesenchymal; Neural,wildtype,Normal,unmethylated,80%,not detected,gain,deletion,90,102,NA,Deceased due to tumor progression,Yes
W40,Yes,Yes,64,Male,GBM,Left Parietal,Complete,primary,184,Neural,wildtype,Negative,unmethylated,40%,not detected,gain,loss,100,NA,NA,Deceased due to tumor progression,Yes
W42,Yes,Yes,59,Female,GBM,Right Frontal; Right Temporal,Complete,primary,197,Neural; Proneural,wildtype,NA,NA,NA,detected,NA,NA,70,NA,NA,Deceased due to tumor progression,Yes
W43,Yes,Yes,61,Female,GBM,Right Temporal,Complete,primary,300,Mesenchymal; Neural,wildtype,NA,NA,NA,NA,NA,NA,90,133,NA,Deceased due to tumor progression,Yes
W48,Yes,Yes,51,Male,GBM; GBM,Right Parietal,Complete,primary,456,Neural,R132G,NA,NA,NA,not detected,NA,NA,80,92,NA,Deceased due to tumor progression,Yes
W5,Yes,Yes,64,Female,GBM; Gr.IV,Right Frontal,Complete,primary,,Classical; Neural,wildtype,Normal,unmethylated,20%,not detected,amplification,loss,90,115,1029,NA,Yes
W50,Yes,Yes,26,Male,GBM Gr.IV; Anaplastic astro. Gr.III,Left Parietal,Complete,primary,,,wildtype,NA,NA,NA,not detected,NA,NA,90,93,951,NA,Yes
W53,Yes,Yes,54,Male,GBM Gr.IV ,Left Temporal,Complete,primary,,Classical,wildtype,NA,NA,NA,not detected,NA,NA,90,312,708,NA,Yes
W54,Yes,No,57,Male,GBM Gr.IV ,Left Temporal,Complete,primary,62,Proneural,wildtype,NA,unmethylated,NA,not detected,NA,NA,70,NA,NA,Deceased due to tumor progression,Yes
W55,Yes,Yes,52,Male,GBM Gr.IV ,Right Temporal,Complete,primary,,Classical,wildtype,NA,NA,NA,detected-ACT+,NA,NA,100,NA,23,NA,Yes
W6,Yes,No,72,Female,GBM Gr.IV ,Left Occipital,Complete,primary,633,Mesenchymal,wildtype,Normal,unmethylated,90%,not detected,gain,Normal,90,107,NA,Deceased due to tumor progression,Yes
W7,Yes,Yes,60,Male,GBM Gr.IV ,Right Temporal,Sub-total,primary,437,Mesenchymal,wildtype,Normal,methylated,negative,not detected,gain,loss,100,366,NA,Deceased due to tumor progression,Yes
W8,Yes,Yes,49,Female,GBM; Gr.IV,Left Parietal,Complete,primary,442,Classical; Mesenchymal,wildtype,Normal,unmethylated,30%,not detected,gain,loss,70,29,NA,Deceased due to tumor progression,Yes
W9,Yes,Yes,50,Male,GBM,Right Frontal,Complete,primary,145,Proneural,wildtype,Normal,unmethylated,30%,not detected,gain,loss,90,109,NA,Deceased due to tumor progression,Yes
W16,No,Yes,76,,GBM; with small cell features; Gr.IV,,Complete,primary,353,Neural; Proneural,,,,,,,,100,,,,No
W21,No,Yes,54,,GBM,,Complete,primary,446,Proneural,,,,,,,,80,,,,No
W27,No,No,64,,GBM Gr.IV ,,Complete,recurrent,72,Classical,,,,,,,,90,,,,No
W28,No,No,68,,GBM Gr.IV ,,Sub-total,primary,300,Mesenchymal; Neural,,,,,,,,100,,,,No
W3,No,No,65,,GBM; Gr.IV; recurrent/residual GBM; Gr.IV,,Complete,primary,982,Classical; Mesenchymal,,,,,,,,100,,,,No
W45,No,Yes,63,,GBM,,Complete,primary,542,,,,,,,,,80,,,,No
W31,No,No,17,,GBM; Gr.IV,,Complete,primary,871,Proneural,,,,,,,,90,,,,Yes
